{"text_format":"1","workbook":"xlsx","n_sheets":9,"sheets":["ÍNDICE","SURF","UV","UV 19_20","MERGULHO-CAÇA","TRIATHLON","COLETE","ACESSÓRIO","Plan1"],"not_rendered":{"charts":0,"images":1,"macros":1,"external_links":1,"defined_names":0,"comments":0,"pivot_tables":0},"unopened":[],"bounds":{"document_bytes":16777216,"sheet_cells":100000,"rows_first":2000,"rows_last":500,"rows_between":2000,"halvings":0,"cell_chars":16384,"cell_head_chars":4096},"cells_cut":0,"cells_raw":0,"read":"whole","date_system":"1900"}

{"sheet":"ÍNDICE","index":0,"n_rows":0,"n_cols":0,"rows_kept":0,"cut":false,"hidden":false,"merged":[]}

{"sheet":"SURF","index":1,"n_rows":81,"n_cols":9,"rows_kept":81,"cut":false,"hidden":false,"merged":[[6,0,7,0],[32,0,40,0],[41,0,45,0],[8,0,15,0],[16,0,21,0],[22,0,23,0],[24,0,31,0],[46,0,52,0],[53,0,59,0],[60,0,62,0],[63,0,72,0],[73,0,80,0]]}
[]
[]
[]
[]
[]
["LINHA","REFERENCIA","DESCRIÇÃO","À VISTA","À PRAZO","SUGESTÃO","MARK UP","IPI","ENTREGA"]
["1 - FLEXXXA TOP","SU001M32FTO3A",{"$f":"IFERROR(VLOOKUP(B7,'[1]Din Rep'!$B:$M,2,0),\"\")","v":"LONG JOHN MANGA LONGA CHESTZIP 3/2 MM MASCULINO FLEXXXA TOP 3 A SURF MORMAII"},{"$f":"IFERROR(IFERROR(VLOOKUP(B7,'[1]Din Rep'!$B:$M,5,0),VLOOKUP(C7,'[1]Din Rep'!$C:$M,4,0)),\"\")","v":719.06004999999993},{"$f":"IFERROR(IFERROR(VLOOKUP(B7,'[1]Din Rep'!$B:$M,7,0),VLOOKUP(C7,'[1]Din Rep'!$C:$M,6,0)),\"\")","v":764.95749999999998},{"$f":"IFERROR(IFERROR(VLOOKUP(B7,'[1]Din Rep'!$B:$M,8,0),VLOOKUP(C7,'[1]Din Rep'!$C:$M,7,0)),\"\")","v":1799.9},{"$f":"IFERROR(IFERROR(VLOOKUP(B7,'[1]Din Rep'!$B:$M,10,0),VLOOKUP(C7,'[1]Din Rep'!$C:$M,9,0)),\"\")","v":2.3529411764705883},{"$f":"IFERROR(IFERROR(VLOOKUP(B7,'[1]Din Rep'!$B:$M,11,0),VLOOKUP(C7,'[1]Din Rep'!$C:$M,10,0)),\"\")","v":0},{"$f":"IFERROR(IFERROR(VLOOKUP(B7,'[1]Din Rep'!$B:$M,12,0),VLOOKUP(C7,'[1]Din Rep'!$C:$M,11,0)),\"\")","v":"45 DD"}]
[null,"SU001M20FTO3A",{"$f":"IFERROR(VLOOKUP(B8,'[1]Din Rep'!$B:$M,2,0),\"\")","v":"LONG JOHN MANGA LONGA CHESTZIP 2 MM MASCULINO FLEXXXA TOP 3 A SURF MORMAII"},{"$f":"IFERROR(IFERROR(VLOOKUP(B8,'[1]Din Rep'!$B:$M,5,0),VLOOKUP(C8,'[1]Din Rep'!$C:$M,4,0)),\"\")","v":687.1000499999999},{"$f":"IFERROR(IFERROR(VLOOKUP(B8,'[1]Din Rep'!$B:$M,7,0),VLOOKUP(C8,'[1]Din Rep'!$C:$M,6,0)),\"\")","v":730.95749999999998},{"$f":"IFERROR(IFERROR(VLOOKUP(B8,'[1]Din Rep'!$B:$M,8,0),VLOOKUP(C8,'[1]Din Rep'!$C:$M,7,0)),\"\")","v":1719.9},{"$f":"IFERROR(IFERROR(VLOOKUP(B8,'[1]Din Rep'!$B:$M,10,0),VLOOKUP(C8,'[1]Din Rep'!$C:$M,9,0)),\"\")","v":2.3529411764705883},{"$f":"IFERROR(IFERROR(VLOOKUP(B8,'[1]Din Rep'!$B:$M,11,0),VLOOKUP(C8,'[1]Din Rep'!$C:$M,10,0)),\"\")","v":0},{"$f":"IFERROR(IFERROR(VLOOKUP(B8,'[1]Din Rep'!$B:$M,12,0),VLOOKUP(C8,'[1]Din Rep'!$C:$M,11,0)),\"\")","v":"45 DD"}]
{"$rows_left_out":74}
{"sheet":"UV","index":2,"n_rows":40,"n_cols":9,"rows_kept":40,"cut":false,"hidden":false,"merged":[[6,0,20,0],[21,0,27,0],[28,0,36,0],[37,0,39,0]]}
[]
[]
[]
[]
[]
["LINHA","REFERENCIA","DESCRIÇÃO","À VISTA","À PRAZO","SUGESTÃO","MARK UP","IPI","ENTREGA"]
["1 - UV MASCULINO","UV037M00DAM2A",{"$f":"IFERROR(VLOOKUP(B7,'[1]Din Rep'!$B:$M,2,0),\"\")","v":"CAMISETA MANGA LONGA MASCULINO DRY ACTION 2A UV MORMAII"},{"$f":"IFERROR(IFERROR(VLOOKUP(B7,'[1]Din Rep'!$B:$M,5,0),VLOOKUP(C7,'[1]Din Rep'!$C:$M,4,0)),\"\")","v":32.64714},{"$f":"IFERROR(IFERROR(VLOOKUP(B7,'[1]Din Rep'!$B:$M,7,0),VLOOKUP(C7,'[1]Din Rep'!$C:$M,6,0)),\"\")","v":34.731000000000002},{"$f":"IFERROR(IFERROR(VLOOKUP(B7,'[1]Din Rep'!$B:$M,8,0),VLOOKUP(C7,'[1]Din Rep'!$C:$M,7,0)),\"\")","v":89.89200000000001},{"$f":"IFERROR(IFERROR(VLOOKUP(B7,'[1]Din Rep'!$B:$M,10,0),VLOOKUP(C7,'[1]Din Rep'!$C:$M,9,0)),\"\")","v":2.5882352941176472},{"$f":"IFERROR(IFERROR(VLOOKUP(B7,'[1]Din Rep'!$B:$M,11,0),VLOOKUP(C7,'[1]Din Rep'!$C:$M,10,0)),\"\")","v":0},{"$f":"IFERROR(IFERROR(VLOOKUP(B7,'[1]Din Rep'!$B:$M,12,0),VLOOKUP(C7,'[1]Din Rep'!$C:$M,11,0)),\"\")","v":"ESTOQUE"}]
[null,"UV037M00DAM2B",{"$f":"IFERROR(VLOOKUP(B8,'[1]Din Rep'!$B:$M,2,0),\"\")","v":" CAMISETA MANGA LONGA MASCULINO DRY ACTION 2B UV MORMAII"},{"$f":"IFERROR(IFERROR(VLOOKUP(B8,'[1]Din Rep'!$B:$M,5,0),VLOOKUP(C8,'[1]Din Rep'!$C:$M,4,0)),\"\")","v":32.64714},{"$f":"IFERROR(IFERROR(VLOOKUP(B8,'[1]Din Rep'!$B:$M,7,0),VLOOKUP(C8,'[1]Din Rep'!$C:$M,6,0)),\"\")","v":34.731000000000002},{"$f":"IFERROR(IFERROR(VLOOKUP(B8,'[1]Din Rep'!$B:$M,8,0),VLOOKUP(C8,'[1]Din Rep'!$C:$M,7,0)),\"\")","v":89.89200000000001},{"$f":"IFERROR(IFERROR(VLOOKUP(B8,'[1]Din Rep'!$B:$M,10,0),VLOOKUP(C8,'[1]Din Rep'!$C:$M,9,0)),\"\")","v":2.5882352941176472},{"$f":"IFERROR(IFERROR(VLOOKUP(B8,'[1]Din Rep'!$B:$M,11,0),VLOOKUP(C8,'[1]Din Rep'!$C:$M,10,0)),\"\")","v":0},{"$f":"IFERROR(IFERROR(VLOOKUP(B8,'[1]Din Rep'!$B:$M,12,0),VLOOKUP(C8,'[1]Din Rep'!$C:$M,11,0)),\"\")","v":"ESTOQUE"}]
{"$rows_left_out":33}
{"sheet":"UV 19_20","index":3,"n_rows":45,"n_cols":9,"rows_kept":45,"cut":false,"hidden":false,"merged":[[6,0,18,0],[19,0,24,0],[25,0,30,0],[31,0,36,0],[37,0,44,0]]}
[]
[]
[]
[]
[]
["LINHA","REFERENCIA","DESCRIÇÃO","À VISTA","À PRAZO","SUGESTÃO","MARK UP","IPI","ENTREGA"]
["1 - UV MASCULINO","UV038M00DSM1A",{"$f":"IFERROR(VLOOKUP(B7,'[1]Din Rep'!$B:$M,2,0),\"\")","v":"CAMISETA MANGA LONGA C/ CAPUZ MASCULINO DRY SMART 1A UV MORMAII"},{"$f":"IFERROR(IFERROR(VLOOKUP(B7,'[1]Din Rep'!$B:$M,5,0),VLOOKUP(C7,'[1]Din Rep'!$C:$M,4,0)),\"\")","v":61.706769999999992},{"$f":"IFERROR(IFERROR(VLOOKUP(B7,'[1]Din Rep'!$B:$M,7,0),VLOOKUP(C7,'[1]Din Rep'!$C:$M,6,0)),\"\")","v":65.645499999999998},{"$f":"IFERROR(IFERROR(VLOOKUP(B7,'[1]Din Rep'!$B:$M,8,0),VLOOKUP(C7,'[1]Din Rep'!$C:$M,7,0)),\"\")","v":169.9},{"$f":"IFERROR(IFERROR(VLOOKUP(B7,'[1]Din Rep'!$B:$M,10,0),VLOOKUP(C7,'[1]Din Rep'!$C:$M,9,0)),\"\")","v":2.5881438940978438},{"$f":"IFERROR(IFERROR(VLOOKUP(B7,'[1]Din Rep'!$B:$M,11,0),VLOOKUP(C7,'[1]Din Rep'!$C:$M,10,0)),\"\")","v":0},{"$f":"IFERROR(IFERROR(VLOOKUP(B7,'[1]Din Rep'!$B:$M,12,0),VLOOKUP(C7,'[1]Din Rep'!$C:$M,11,0)),\"\")","v":"ESTOQUE"}]
[null,"UV037M00DFX3A",{"$f":"IFERROR(VLOOKUP(B8,'[1]Din Rep'!$B:$M,2,0),\"\")","v":"CAMISETA MANGA LONGA MASCULINO DRY FLEX 3A UV MORMAII"},{"$f":"IFERROR(IFERROR(VLOOKUP(B8,'[1]Din Rep'!$B:$M,5,0),VLOOKUP(C8,'[1]Din Rep'!$C:$M,4,0)),\"\")","v":58.07132},{"$f":"IFERROR(IFERROR(VLOOKUP(B8,'[1]Din Rep'!$B:$M,7,0),VLOOKUP(C8,'[1]Din Rep'!$C:$M,6,0)),\"\")","v":61.778000000000006},{"$f":"IFERROR(IFERROR(VLOOKUP(B8,'[1]Din Rep'!$B:$M,8,0),VLOOKUP(C8,'[1]Din Rep'!$C:$M,7,0)),\"\")","v":159.9},{"$f":"IFERROR(IFERROR(VLOOKUP(B8,'[1]Din Rep'!$B:$M,10,0),VLOOKUP(C8,'[1]Din Rep'!$C:$M,9,0)),\"\")","v":2.5883000420861793},{"$f":"IFERROR(IFERROR(VLOOKUP(B8,'[1]Din Rep'!$B:$M,11,0),VLOOKUP(C8,'[1]Din Rep'!$C:$M,10,0)),\"\")","v":0},{"$f":"IFERROR(IFERROR(VLOOKUP(B8,'[1]Din Rep'!$B:$M,12,0),VLOOKUP(C8,'[1]Din Rep'!$C:$M,11,0)),\"\")","v":"ESTOQUE"}]
{"$rows_left_out":38}
{"sheet":"MERGULHO-CAÇA","index":4,"n_rows":38,"n_cols":9,"rows_kept":38,"cut":false,"hidden":false,"merged":[[7,0,10,0],[11,0,16,0],[17,0,36,0]]}
[]
[]
[]
[]
[]
["LINHA","REFERENCIA","DESCRIÇÃO","À VISTA","À PRAZO","SUGESTÃO","MARK UP","IPI","ENTREGA"]
["1 - NEXXXUS","MNO1352B",{"$f":"IFERROR(VLOOKUP(B7,'[1]Din Rep'!$B:$M,2,0),\"\")","v":"MACACÃO MANGA LONGA NOZIP 5 MM MASCULINO NEXXXUS 1A MERGULHO MORMAII"},{"$f":"IFERROR(IFERROR(VLOOKUP(B7,'[1]Din Rep'!$B:$M,5,0),VLOOKUP(C7,'[1]Din Rep'!$C:$M,4,0)),\"\")","v":511.32004999999998},{"$f":"IFERROR(IFERROR(VLOOKUP(B7,'[1]Din Rep'!$B:$M,7,0),VLOOKUP(C7,'[1]Din Rep'!$C:$M,6,0)),\"\")","v":543.95749999999998},{"$f":"IFERROR(IFERROR(VLOOKUP(B7,'[1]Din Rep'!$B:$M,8,0),VLOOKUP(C7,'[1]Din Rep'!$C:$M,7,0)),\"\")","v":1023.9200000000001},{"$f":"IFERROR(IFERROR(VLOOKUP(B7,'[1]Din Rep'!$B:$M,10,0),VLOOKUP(C7,'[1]Din Rep'!$C:$M,9,0)),\"\")","v":1.8823529411764708},{"$f":"IFERROR(IFERROR(VLOOKUP(B7,'[1]Din Rep'!$B:$M,11,0),VLOOKUP(C7,'[1]Din Rep'!$C:$M,10,0)),\"\")","v":0},{"$f":"IFERROR(IFERROR(VLOOKUP(B7,'[1]Din Rep'!$B:$M,12,0),VLOOKUP(C7,'[1]Din Rep'!$C:$M,11,0)),\"\")","v":"45 DD"}]
["2 - ATLANTIS","MAFG30832B",{"$f":"IFERROR(VLOOKUP(B8,'[1]Din Rep'!$B:$M,2,0),\"\")","v":"SHORT JOHN MANGA CURTA BACKZIP 3 MM FEMININO ATLANTIS 2A MERGULHO MORMAII"},{"$f":"IFERROR(IFERROR(VLOOKUP(B8,'[1]Din Rep'!$B:$M,5,0),VLOOKUP(C8,'[1]Din Rep'!$C:$M,4,0)),\"\")","v":231.67004999999997},{"$f":"IFERROR(IFERROR(VLOOKUP(B8,'[1]Din Rep'!$B:$M,7,0),VLOOKUP(C8,'[1]Din Rep'!$C:$M,6,0)),\"\")","v":246.45749999999998},{"$f":"IFERROR(IFERROR(VLOOKUP(B8,'[1]Din Rep'!$B:$M,8,0),VLOOKUP(C8,'[1]Din Rep'!$C:$M,7,0)),\"\")","v":463.92},{"$f":"IFERROR(IFERROR(VLOOKUP(B8,'[1]Din Rep'!$B:$M,10,0),VLOOKUP(C8,'[1]Din Rep'!$C:$M,9,0)),\"\")","v":1.8823529411764708},{"$f":"IFERROR(IFERROR(VLOOKUP(B8,'[1]Din Rep'!$B:$M,11,0),VLOOKUP(C8,'[1]Din Rep'!$C:$M,10,0)),\"\")","v":0},{"$f":"IFERROR(IFERROR(VLOOKUP(B8,'[1]Din Rep'!$B:$M,12,0),VLOOKUP(C8,'[1]Din Rep'!$C:$M,11,0)),\"\")","v":"45 DD"}]
{"$rows_left_out":31}
{"sheet":"TRIATHLON","index":5,"n_rows":14,"n_cols":9,"rows_kept":14,"cut":false,"hidden":false,"merged":[[6,0,7,0],[8,0,9,0],[10,0,11,0],[12,0,13,0]]}
[]
[]
[]
[]
[]
["LINHA","REFERENCIA","DESCRIÇÃO","À VISTA","À PRAZO","SUGESTÃO","MARK UP","IPI","ENTREGA"]
["1 - MASCULINO ÁGUAS ABERTAS 3,1 MM","AA001M31THT4A",{"$f":"IFERROR(VLOOKUP(B7,'[1]Din Rep'!$B:$M,2,0),\"\")","v":"LONG JOHN MANGA LONGA BACKZIP 3/1MM MASCULINO TRIATHLON 4A ÁGUAS ABERTAS MORMAII"},{"$f":"IFERROR(IFERROR(VLOOKUP(B7,'[1]Din Rep'!$B:$M,5,0),VLOOKUP(C7,'[1]Din Rep'!$C:$M,4,0)),\"\")","v":600.88435449999997},{"$f":"IFERROR(IFERROR(VLOOKUP(B7,'[1]Din Rep'!$B:$M,7,0),VLOOKUP(C7,'[1]Din Rep'!$C:$M,6,0)),\"\")","v":639.23867500000006},{"$f":"IFERROR(IFERROR(VLOOKUP(B7,'[1]Din Rep'!$B:$M,8,0),VLOOKUP(C7,'[1]Din Rep'!$C:$M,7,0)),\"\")","v":1504.9},{"$f":"IFERROR(IFERROR(VLOOKUP(B7,'[1]Din Rep'!$B:$M,10,0),VLOOKUP(C7,'[1]Din Rep'!$C:$M,9,0)),\"\")","v":2.354206744452688},{"$f":"IFERROR(IFERROR(VLOOKUP(B7,'[1]Din Rep'!$B:$M,11,0),VLOOKUP(C7,'[1]Din Rep'!$C:$M,10,0)),\"\")","v":0},{"$f":"IFERROR(IFERROR(VLOOKUP(B7,'[1]Din Rep'!$B:$M,12,0),VLOOKUP(C7,'[1]Din Rep'!$C:$M,11,0)),\"\")","v":"45 DD"}]
[null,"AA004M31THT4A",{"$f":"IFERROR(VLOOKUP(B8,'[1]Din Rep'!$B:$M,2,0),\"\")","v":"LONG JOHN SEM MANGA BACKZIP 3/1MM MASCULINO TRIATHLON 4A ÁGUAS ABERTAS MORMAII"},{"$f":"IFERROR(IFERROR(VLOOKUP(B8,'[1]Din Rep'!$B:$M,5,0),VLOOKUP(C8,'[1]Din Rep'!$C:$M,4,0)),\"\")","v":513.79335450000008},{"$f":"IFERROR(IFERROR(VLOOKUP(B8,'[1]Din Rep'!$B:$M,7,0),VLOOKUP(C8,'[1]Din Rep'!$C:$M,6,0)),\"\")","v":546.58867500000008},{"$f":"IFERROR(IFERROR(VLOOKUP(B8,'[1]Din Rep'!$B:$M,8,0),VLOOKUP(C8,'[1]Din Rep'!$C:$M,7,0)),\"\")","v":1289.9000000000001},{"$f":"IFERROR(IFERROR(VLOOKUP(B8,'[1]Din Rep'!$B:$M,10,0),VLOOKUP(C8,'[1]Din Rep'!$C:$M,9,0)),\"\")","v":2.3599098536024368},{"$f":"IFERROR(IFERROR(VLOOKUP(B8,'[1]Din Rep'!$B:$M,11,0),VLOOKUP(C8,'[1]Din Rep'!$C:$M,10,0)),\"\")","v":0},{"$f":"IFERROR(IFERROR(VLOOKUP(B8,'[1]Din Rep'!$B:$M,12,0),VLOOKUP(C8,'[1]Din Rep'!$C:$M,11,0)),\"\")","v":"45 DD"}]
{"$rows_left_out":7}
{"sheet":"COLETE","index":6,"n_rows":30,"n_cols":9,"rows_kept":30,"cut":false,"hidden":false,"merged":[[6,0,10,0],[11,0,15,0],[16,0,20,0],[21,0,24,0],[25,0,28,0]]}
[]
[]
[]
[]
[]
["LINHA","REFERENCIA","DESCRIÇÃO","À VISTA","À PRAZO","SUGESTÃO","MARK UP","IPI","ENTREGA"]
["1 - COLETES HOMOLOGADO LINHA TOP","S001WBN3",{"$f":"IFERROR(VLOOKUP(B7,'[1]Din Rep'!$B:$M,2,0),\"\")","v":"COLETE SALVA-VIDAS CLASSE V - COM ZIPPER"},{"$f":"IFERROR(IFERROR(VLOOKUP(B7,'[1]Din Rep'!$B:$M,5,0),VLOOKUP(C7,'[1]Din Rep'!$C:$M,4,0)),\"\")","v":183.76999999999998},{"$f":"IFERROR(IFERROR(VLOOKUP(B7,'[1]Din Rep'!$B:$M,7,0),VLOOKUP(C7,'[1]Din Rep'!$C:$M,6,0)),\"\")","v":195.5},{"$f":"IFERROR(IFERROR(VLOOKUP(B7,'[1]Din Rep'!$B:$M,8,0),VLOOKUP(C7,'[1]Din Rep'!$C:$M,7,0)),\"\")","v":460},{"$f":"IFERROR(IFERROR(VLOOKUP(B7,'[1]Din Rep'!$B:$M,10,0),VLOOKUP(C7,'[1]Din Rep'!$C:$M,9,0)),\"\")","v":2.3529411764705883},{"$f":"IFERROR(IFERROR(VLOOKUP(B7,'[1]Din Rep'!$B:$M,11,0),VLOOKUP(C7,'[1]Din Rep'!$C:$M,10,0)),\"\")","v":0},{"$f":"IFERROR(IFERROR(VLOOKUP(B7,'[1]Din Rep'!$B:$M,12,0),VLOOKUP(C7,'[1]Din Rep'!$C:$M,11,0)),\"\")","v":"45 DD"}]
[null,"S001WBNG3",{"$f":"IFERROR(VLOOKUP(B8,'[1]Din Rep'!$B:$M,2,0),\"\")","v":"COLETE SALVA-VIDAS CLASSE V - COM ZIPPER"},{"$f":"IFERROR(IFERROR(VLOOKUP(B8,'[1]Din Rep'!$B:$M,5,0),VLOOKUP(C8,'[1]Din Rep'!$C:$M,4,0)),\"\")","v":183.76999999999998},{"$f":"IFERROR(IFERROR(VLOOKUP(B8,'[1]Din Rep'!$B:$M,7,0),VLOOKUP(C8,'[1]Din Rep'!$C:$M,6,0)),\"\")","v":195.5},{"$f":"IFERROR(IFERROR(VLOOKUP(B8,'[1]Din Rep'!$B:$M,8,0),VLOOKUP(C8,'[1]Din Rep'!$C:$M,7,0)),\"\")","v":460},{"$f":"IFERROR(IFERROR(VLOOKUP(B8,'[1]Din Rep'!$B:$M,10,0),VLOOKUP(C8,'[1]Din Rep'!$C:$M,9,0)),\"\")","v":2.3529411764705883},{"$f":"IFERROR(IFERROR(VLOOKUP(B8,'[1]Din Rep'!$B:$M,11,0),VLOOKUP(C8,'[1]Din Rep'!$C:$M,10,0)),\"\")","v":0},{"$f":"IFERROR(IFERROR(VLOOKUP(B8,'[1]Din Rep'!$B:$M,12,0),VLOOKUP(C8,'[1]Din Rep'!$C:$M,11,0)),\"\")","v":"45 DD"}]
{"$rows_left_out":23}
{"sheet":"ACESSÓRIO","index":7,"n_rows":67,"n_cols":9,"rows_kept":67,"cut":false,"hidden":false,"merged":[[6,0,55,0],[56,0,66,0]]}
[]
[]
[]
[]
[]
["LINHA","REFERENCIA","DESCRIÇÃO","À VISTA","À PRAZO","SUGESTÃO","MARK UP","IPI","ENTREGA"]
["ACESSÓRIOS 2017/18","A091",{"$f":"IFERROR(VLOOKUP(B7,'[1]Din Rep'!$B:$M,2,0),\"\")","v":"POCHETE C/ 2 ZIPERS NEOPRENE - MORMAII"},{"$f":"IFERROR(IFERROR(VLOOKUP(B7,'[1]Din Rep'!$B:$M,5,0),VLOOKUP(C7,'[1]Din Rep'!$C:$M,4,0)),\"\")","v":43.545499999999997},{"$f":"IFERROR(IFERROR(VLOOKUP(B7,'[1]Din Rep'!$B:$M,7,0),VLOOKUP(C7,'[1]Din Rep'!$C:$M,6,0)),\"\")","v":46.325000000000003},{"$f":"IFERROR(IFERROR(VLOOKUP(B7,'[1]Din Rep'!$B:$M,8,0),VLOOKUP(C7,'[1]Din Rep'!$C:$M,7,0)),\"\")","v":119.90000000000002},{"$f":"IFERROR(IFERROR(VLOOKUP(B7,'[1]Din Rep'!$B:$M,10,0),VLOOKUP(C7,'[1]Din Rep'!$C:$M,9,0)),\"\")","v":2.3294117647058825},{"$f":"IFERROR(IFERROR(VLOOKUP(B7,'[1]Din Rep'!$B:$M,11,0),VLOOKUP(C7,'[1]Din Rep'!$C:$M,10,0)),\"\")","v":0.1},{"$f":"IFERROR(IFERROR(VLOOKUP(B7,'[1]Din Rep'!$B:$M,12,0),VLOOKUP(C7,'[1]Din Rep'!$C:$M,11,0)),\"\")","v":"45 DD"}]
[null,"A092",{"$f":"IFERROR(VLOOKUP(B8,'[1]Din Rep'!$B:$M,2,0),\"\")","v":"LIXEIRA DE NEOPRENE P/ CARRO - MORMAII"},{"$f":"IFERROR(IFERROR(VLOOKUP(B8,'[1]Din Rep'!$B:$M,5,0),VLOOKUP(C8,'[1]Din Rep'!$C:$M,4,0)),\"\")","v":10.778509999999999},{"$f":"IFERROR(IFERROR(VLOOKUP(B8,'[1]Din Rep'!$B:$M,7,0),VLOOKUP(C8,'[1]Din Rep'!$C:$M,6,0)),\"\")","v":11.4665},{"$f":"IFERROR(IFERROR(VLOOKUP(B8,'[1]Din Rep'!$B:$M,8,0),VLOOKUP(C8,'[1]Din Rep'!$C:$M,7,0)),\"\")","v":29.678000000000004},{"$f":"IFERROR(IFERROR(VLOOKUP(B8,'[1]Din Rep'!$B:$M,10,0),VLOOKUP(C8,'[1]Din Rep'!$C:$M,9,0)),\"\")","v":2.329411764705883},{"$f":"IFERROR(IFERROR(VLOOKUP(B8,'[1]Din Rep'!$B:$M,11,0),VLOOKUP(C8,'[1]Din Rep'!$C:$M,10,0)),\"\")","v":0.1},{"$f":"IFERROR(IFERROR(VLOOKUP(B8,'[1]Din Rep'!$B:$M,12,0),VLOOKUP(C8,'[1]Din Rep'!$C:$M,11,0)),\"\")","v":"45 DD"}]
{"$rows_left_out":60}
{"sheet":"Plan1","index":8,"n_rows":0,"n_cols":0,"rows_kept":0,"cut":false,"hidden":false,"merged":[]}