{"text_format":"1","workbook":"xlsx","n_sheets":9,"sheets":["ÍNDICE","SURF","UV","UV 19_20","MERGULHO-CAÇA","TRIATHLON","COLETE","ACESSÓRIO","Plan1"],"not_rendered":{"charts":0,"images":1,"macros":1,"external_links":1,"defined_names":0,"comments":0,"pivot_tables":0},"unopened":[],"bounds":{"document_bytes":16777216,"sheet_cells":100000,"rows_first":2000,"rows_last":500,"rows_between":2000,"halvings":0,"cell_chars":16384,"cell_head_chars":4096},"cells_cut":0,"cells_raw":0,"read":"whole","date_system":"1900"}

{"sheet":"ÍNDICE","index":0,"n_rows":0,"n_cols":0,"rows_kept":0,"cut":false,"hidden":false,"merged":[]}

{"sheet":"SURF","index":1,"n_rows":81,"n_cols":9,"rows_kept":81,"cut":false,"hidden":false,"merged":[[6,0,7,0],[32,0,40,0],[41,0,45,0],[8,0,15,0],[16,0,21,0],[22,0,23,0],[24,0,31,0],[46,0,52,0],[53,0,59,0],[60,0,62,0],[63,0,72,0],[73,0,80,0]]}
[]
[]
[]
[]
[]
["LINHA","REFERENCIA","DESCRIÇÃO","À VISTA","À PRAZO","SUGESTÃO","MARK UP","IPI","ENTREGA"]
["1 - FLEXXXA TOP","SU001M32FTO3A",{"$f":"IFERROR(VLOOKUP(B7,'[1]Din Rep'!$B:$M,2,0),\"\")","v":"LONG JOHN MANGA LONGA CHESTZIP 3/2 MM MASCULINO FLEXXXA TOP 3 A SURF MORMAII"},{"$f":"IFERROR(IFERROR(VLOOKUP(B7,'[1]Din Rep'!$B:$M,5,0),VLOOKUP(C7,'[1]Din Rep'!$C:$M,4,0)),\"\")","v":719.06004999999993},{"$f":"IFERROR(IFERROR(VLOOKUP(B7,'[1]Din Rep'!$B:$M,7,0),VLOOKUP(C7,'[1]Din Rep'!$C:$M,6,0)),\"\")","v":764.95749999999998},{"$f":"IFERROR(IFERROR(VLOOKUP(B7,'[1]Din Rep'!$B:$M,8,0),VLOOKUP(C7,'[1]Din Rep'!$C:$M,7,0)),\"\")","v":1799.9},{"$f":"IFERROR(IFERROR(VLOOKUP(B7,'[1]Din Rep'!$B:$M,10,0),VLOOKUP(C7,'[1]Din Rep'!$C:$M,9,0)),\"\")","v":2.3529411764705883},{"$f":"IFERROR(IFERROR(VLOOKUP(B7,'[1]Din Rep'!$B:$M,11,0),VLOOKUP(C7,'[1]Din Rep'!$C:$M,10,0)),\"\")","v":0},{"$f":"IFERROR(IFERROR(VLOOKUP(B7,'[1]Din Rep'!$B:$M,12,0),VLOOKUP(C7,'[1]Din Rep'!$C:$M,11,0)),\"\")","v":"45 DD"}]
[null,"SU001M20FTO3A",{"$f":"IFERROR(VLOOKUP(B8,'[1]Din Rep'!$B:$M,2,0),\"\")","v":"LONG JOHN MANGA LONGA CHESTZIP 2 MM MASCULINO FLEXXXA TOP 3 A SURF MORMAII"},{"$f":"IFERROR(IFERROR(VLOOKUP(B8,'[1]Din Rep'!$B:$M,5,0),VLOOKUP(C8,'[1]Din Rep'!$C:$M,4,0)),\"\")","v":687.1000499999999},{"$f":"IFERROR(IFERROR(VLOOKUP(B8,'[1]Din Rep'!$B:$M,7,0),VLOOKUP(C8,'[1]Din Rep'!$C:$M,6,0)),\"\")","v":730.95749999999998},{"$f":"IFERROR(IFERROR(VLOOKUP(B8,'[1]Din Rep'!$B:$M,8,0),VLOOKUP(C8,'[1]Din Rep'!$C:$M,7,0)),\"\")","v":1719.9},{"$f":"IFERROR(IFERROR(VLOOKUP(B8,'[1]Din Rep'!$B:$M,10,0),VLOOKUP(C8,'[1]Din Rep'!$C:$M,9,0)),\"\")","v":2.3529411764705883},{"$f":"IFERROR(IFERROR(VLOOKUP(B8,'[1]Din Rep'!$B:$M,11,0),VLOOKUP(C8,'[1]Din Rep'!$C:$M,10,0)),\"\")","v":0},{"$f":"IFERROR(IFERROR(VLOOKUP(B8,'[1]Din Rep'!$B:$M,12,0),VLOOKUP(C8,'[1]Din Rep'!$C:$M,11,0)),\"\")","v":"45 DD"}]
["1 - FLEXXXA PRO","SU001M32FPR4A",{"$f":"IFERROR(VLOOKUP(B9,'[1]Din Rep'!$B:$M,2,0),\"\")","v":"LONG JOHN MANGA LONGA UTOPIA SYSTEM 3/2 MM MASCULINO FLEXXXA PRO 4 A SURF MORMAII"},{"$f":"IFERROR(IFERROR(VLOOKUP(B9,'[1]Din Rep'!$B:$M,5,0),VLOOKUP(C9,'[1]Din Rep'!$C:$M,4,0)),\"\")","v":559.26004999999998},{"$f":"IFERROR(IFERROR(VLOOKUP(B9,'[1]Din Rep'!$B:$M,7,0),VLOOKUP(C9,'[1]Din Rep'!$C:$M,6,0)),\"\")","v":594.95749999999998},{"$f":"IFERROR(IFERROR(VLOOKUP(B9,'[1]Din Rep'!$B:$M,8,0),VLOOKUP(C9,'[1]Din Rep'!$C:$M,7,0)),\"\")","v":1399.9},{"$f":"IFERROR(IFERROR(VLOOKUP(B9,'[1]Din Rep'!$B:$M,10,0),VLOOKUP(C9,'[1]Din Rep'!$C:$M,9,0)),\"\")","v":2.3529411764705883},{"$f":"IFERROR(IFERROR(VLOOKUP(B9,'[1]Din Rep'!$B:$M,11,0),VLOOKUP(C9,'[1]Din Rep'!$C:$M,10,0)),\"\")","v":0},{"$f":"IFERROR(IFERROR(VLOOKUP(B9,'[1]Din Rep'!$B:$M,12,0),VLOOKUP(C9,'[1]Din Rep'!$C:$M,11,0)),\"\")","v":"45 DD"}]
[null,"SU001M20FPR4A",{"$f":"IFERROR(VLOOKUP(B10,'[1]Din Rep'!$B:$M,2,0),\"\")","v":"LONG JOHN MANGA LONGA UTOPIA SYSTEM 2/2 MM MASCULINO FLEXXXA PRO 4 A SURF MORMAII"},{"$f":"IFERROR(IFERROR(VLOOKUP(B10,'[1]Din Rep'!$B:$M,5,0),VLOOKUP(C10,'[1]Din Rep'!$C:$M,4,0)),\"\")","v":538.92549999999994},{"$f":"IFERROR(IFERROR(VLOOKUP(B10,'[1]Din Rep'!$B:$M,7,0),VLOOKUP(C10,'[1]Din Rep'!$C:$M,6,0)),\"\")","v":573.32499999999993},{"$f":"IFERROR(IFERROR(VLOOKUP(B10,'[1]Din Rep'!$B:$M,8,0),VLOOKUP(C10,'[1]Din Rep'!$C:$M,7,0)),\"\")","v":1349},{"$f":"IFERROR(IFERROR(VLOOKUP(B10,'[1]Din Rep'!$B:$M,10,0),VLOOKUP(C10,'[1]Din Rep'!$C:$M,9,0)),\"\")","v":2.3529411764705883},{"$f":"IFERROR(IFERROR(VLOOKUP(B10,'[1]Din Rep'!$B:$M,11,0),VLOOKUP(C10,'[1]Din Rep'!$C:$M,10,0)),\"\")","v":0},{"$f":"IFERROR(IFERROR(VLOOKUP(B10,'[1]Din Rep'!$B:$M,12,0),VLOOKUP(C10,'[1]Din Rep'!$C:$M,11,0)),\"\")","v":"45 DD"}]
[null,"SU001M32FPR4B",{"$f":"IFERROR(VLOOKUP(B11,'[1]Din Rep'!$B:$M,2,0),\"\")","v":"LONG JOHN  MANGA LONGA CHEST 3/2 MM MASCULINO FLEXXXA PRO 4 B SURF MORMAII "},{"$f":"IFERROR(IFERROR(VLOOKUP(B11,'[1]Din Rep'!$B:$M,5,0),VLOOKUP(C11,'[1]Din Rep'!$C:$M,4,0)),\"\")","v":559.26004999999998},{"$f":"IFERROR(IFERROR(VLOOKUP(B11,'[1]Din Rep'!$B:$M,7,0),VLOOKUP(C11,'[1]Din Rep'!$C:$M,6,0)),\"\")","v":594.95749999999998},{"$f":"IFERROR(IFERROR(VLOOKUP(B11,'[1]Din Rep'!$B:$M,8,0),VLOOKUP(C11,'[1]Din Rep'!$C:$M,7,0)),\"\")","v":1399.9},{"$f":"IFERROR(IFERROR(VLOOKUP(B11,'[1]Din Rep'!$B:$M,10,0),VLOOKUP(C11,'[1]Din Rep'!$C:$M,9,0)),\"\")","v":2.3529411764705883},{"$f":"IFERROR(IFERROR(VLOOKUP(B11,'[1]Din Rep'!$B:$M,11,0),VLOOKUP(C11,'[1]Din Rep'!$C:$M,10,0)),\"\")","v":0},{"$f":"IFERROR(IFERROR(VLOOKUP(B11,'[1]Din Rep'!$B:$M,12,0),VLOOKUP(C11,'[1]Din Rep'!$C:$M,11,0)),\"\")","v":"45 DD"}]
[null,"SU001M20FPR4B",{"$f":"IFERROR(VLOOKUP(B12,'[1]Din Rep'!$B:$M,2,0),\"\")","v":"LONG JOHN  MANGA LONGA CHEST 2/2 MM MASCULINO FLEXXXA PRO 4 B SURF MORMAII "},{"$f":"IFERROR(IFERROR(VLOOKUP(B12,'[1]Din Rep'!$B:$M,5,0),VLOOKUP(C12,'[1]Din Rep'!$C:$M,4,0)),\"\")","v":539.28504999999996},{"$f":"IFERROR(IFERROR(VLOOKUP(B12,'[1]Din Rep'!$B:$M,7,0),VLOOKUP(C12,'[1]Din Rep'!$C:$M,6,0)),\"\")","v":573.70749999999998},{"$f":"IFERROR(IFERROR(VLOOKUP(B12,'[1]Din Rep'!$B:$M,8,0),VLOOKUP(C12,'[1]Din Rep'!$C:$M,7,0)),\"\")","v":1349.9},{"$f":"IFERROR(IFERROR(VLOOKUP(B12,'[1]Din Rep'!$B:$M,10,0),VLOOKUP(C12,'[1]Din Rep'!$C:$M,9,0)),\"\")","v":2.3529411764705883},{"$f":"IFERROR(IFERROR(VLOOKUP(B12,'[1]Din Rep'!$B:$M,11,0),VLOOKUP(C12,'[1]Din Rep'!$C:$M,10,0)),\"\")","v":0},{"$f":"IFERROR(IFERROR(VLOOKUP(B12,'[1]Din Rep'!$B:$M,12,0),VLOOKUP(C12,'[1]Din Rep'!$C:$M,11,0)),\"\")","v":"45 DD"}]
[null,"SU001M10FPR4A",{"$f":"IFERROR(VLOOKUP(B13,'[1]Din Rep'!$B:$M,2,0),\"\")","v":"LONG JOHN MANGA LONGA CHESTZIP1.0MM MASCULINO FLEXXXA PRO 1 A SURF MORMAII"},{"$f":"IFERROR(IFERROR(VLOOKUP(B13,'[1]Din Rep'!$B:$M,5,0),VLOOKUP(C13,'[1]Din Rep'!$C:$M,4,0)),\"\")","v":279.61004999999994},{"$f":"IFERROR(IFERROR(VLOOKUP(B13,'[1]Din Rep'!$B:$M,7,0),VLOOKUP(C13,'[1]Din Rep'!$C:$M,6,0)),\"\")","v":297.45749999999998},{"$f":"IFERROR(IFERROR(VLOOKUP(B13,'[1]Din Rep'!$B:$M,8,0),VLOOKUP(C13,'[1]Din Rep'!$C:$M,7,0)),\"\")","v":699.9},{"$f":"IFERROR(IFERROR(VLOOKUP(B13,'[1]Din Rep'!$B:$M,10,0),VLOOKUP(C13,'[1]Din Rep'!$C:$M,9,0)),\"\")","v":2.3529411764705883},{"$f":"IFERROR(IFERROR(VLOOKUP(B13,'[1]Din Rep'!$B:$M,11,0),VLOOKUP(C13,'[1]Din Rep'!$C:$M,10,0)),\"\")","v":0},{"$f":"IFERROR(IFERROR(VLOOKUP(B13,'[1]Din Rep'!$B:$M,12,0),VLOOKUP(C13,'[1]Din Rep'!$C:$M,11,0)),\"\")","v":"45 DD"}]
[null,"SU005M10FPR4A",{"$f":"IFERROR(VLOOKUP(B14,'[1]Din Rep'!$B:$M,2,0),\"\")","v":"SHORT JOHN MANGA LONGA CHESTZIP 1.0MM MASCULINO FLEXXXA PRO 4 A SURF MORMAII"},{"$f":"IFERROR(IFERROR(VLOOKUP(B14,'[1]Din Rep'!$B:$M,5,0),VLOOKUP(C14,'[1]Din Rep'!$C:$M,4,0)),\"\")","v":239.66004999999996},{"$f":"IFERROR(IFERROR(VLOOKUP(B14,'[1]Din Rep'!$B:$M,7,0),VLOOKUP(C14,'[1]Din Rep'!$C:$M,6,0)),\"\")","v":254.95749999999998},{"$f":"IFERROR(IFERROR(VLOOKUP(B14,'[1]Din Rep'!$B:$M,8,0),VLOOKUP(C14,'[1]Din Rep'!$C:$M,7,0)),\"\")","v":599.9},{"$f":"IFERROR(IFERROR(VLOOKUP(B14,'[1]Din Rep'!$B:$M,10,0),VLOOKUP(C14,'[1]Din Rep'!$C:$M,9,0)),\"\")","v":2.3529411764705883},{"$f":"IFERROR(IFERROR(VLOOKUP(B14,'[1]Din Rep'!$B:$M,11,0),VLOOKUP(C14,'[1]Din Rep'!$C:$M,10,0)),\"\")","v":0},{"$f":"IFERROR(IFERROR(VLOOKUP(B14,'[1]Din Rep'!$B:$M,12,0),VLOOKUP(C14,'[1]Din Rep'!$C:$M,11,0)),\"\")","v":"45 DD"}]
[null,"SU030M10FPR4A",{"$f":"IFERROR(VLOOKUP(B15,'[1]Din Rep'!$B:$M,2,0),\"\")","v":"JAQUETA MANGA LONGA 1.0MM MASCULINO FLEXXXA PRO  4 A SURF MORMAII"},{"$f":"IFERROR(IFERROR(VLOOKUP(B15,'[1]Din Rep'!$B:$M,5,0),VLOOKUP(C15,'[1]Din Rep'!$C:$M,4,0)),\"\")","v":159.76004999999998},{"$f":"IFERROR(IFERROR(VLOOKUP(B15,'[1]Din Rep'!$B:$M,7,0),VLOOKUP(C15,'[1]Din Rep'!$C:$M,6,0)),\"\")","v":169.95749999999998},{"$f":"IFERROR(IFERROR(VLOOKUP(B15,'[1]Din Rep'!$B:$M,8,0),VLOOKUP(C15,'[1]Din Rep'!$C:$M,7,0)),\"\")","v":399.9},{"$f":"IFERROR(IFERROR(VLOOKUP(B15,'[1]Din Rep'!$B:$M,10,0),VLOOKUP(C15,'[1]Din Rep'!$C:$M,9,0)),\"\")","v":2.3529411764705883},{"$f":"IFERROR(IFERROR(VLOOKUP(B15,'[1]Din Rep'!$B:$M,11,0),VLOOKUP(C15,'[1]Din Rep'!$C:$M,10,0)),\"\")","v":0},{"$f":"IFERROR(IFERROR(VLOOKUP(B15,'[1]Din Rep'!$B:$M,12,0),VLOOKUP(C15,'[1]Din Rep'!$C:$M,11,0)),\"\")","v":"45 DD"}]
[null,"SU054M10FPR4A",{"$f":"IFERROR(VLOOKUP(B16,'[1]Din Rep'!$B:$M,2,0),\"\")","v":"BERMUDA 1.0MM MASCULINOFLEXXXA PRO 4 A SURF MORMAII"},{"$f":"IFERROR(IFERROR(VLOOKUP(B16,'[1]Din Rep'!$B:$M,5,0),VLOOKUP(C16,'[1]Din Rep'!$C:$M,4,0)),\"\")","v":99.835049999999995},{"$f":"IFERROR(IFERROR(VLOOKUP(B16,'[1]Din Rep'!$B:$M,7,0),VLOOKUP(C16,'[1]Din Rep'!$C:$M,6,0)),\"\")","v":106.2075},{"$f":"IFERROR(IFERROR(VLOOKUP(B16,'[1]Din Rep'!$B:$M,8,0),VLOOKUP(C16,'[1]Din Rep'!$C:$M,7,0)),\"\")","v":249.9},{"$f":"IFERROR(IFERROR(VLOOKUP(B16,'[1]Din Rep'!$B:$M,10,0),VLOOKUP(C16,'[1]Din Rep'!$C:$M,9,0)),\"\")","v":2.3529411764705883},{"$f":"IFERROR(IFERROR(VLOOKUP(B16,'[1]Din Rep'!$B:$M,11,0),VLOOKUP(C16,'[1]Din Rep'!$C:$M,10,0)),\"\")","v":0},{"$f":"IFERROR(IFERROR(VLOOKUP(B16,'[1]Din Rep'!$B:$M,12,0),VLOOKUP(C16,'[1]Din Rep'!$C:$M,11,0)),\"\")","v":"45 DD"}]
["2 - ULTRA SKIN","SU001M32USK3B",{"$f":"IFERROR(VLOOKUP(B17,'[1]Din Rep'!$B:$M,2,0),\"\")","v":"LONG JOHN MANGA LONGA BACKZIP 3/2MM MASCULINO ULTRA SKIN 3 B SURF MORMAII"},{"$f":"IFERROR(IFERROR(VLOOKUP(B17,'[1]Din Rep'!$B:$M,5,0),VLOOKUP(C17,'[1]Din Rep'!$C:$M,4,0)),\"\")","v":439.41005000000001},{"$f":"IFERROR(IFERROR(VLOOKUP(B17,'[1]Din Rep'!$B:$M,7,0),VLOOKUP(C17,'[1]Din Rep'!$C:$M,6,0)),\"\")","v":467.45750000000004},{"$f":"IFERROR(IFERROR(VLOOKUP(B17,'[1]Din Rep'!$B:$M,8,0),VLOOKUP(C17,'[1]Din Rep'!$C:$M,7,0)),\"\")","v":1099.9000000000001},{"$f":"IFERROR(IFERROR(VLOOKUP(B17,'[1]Din Rep'!$B:$M,10,0),VLOOKUP(C17,'[1]Din Rep'!$C:$M,9,0)),\"\")","v":2.3529411764705883},{"$f":"IFERROR(IFERROR(VLOOKUP(B17,'[1]Din Rep'!$B:$M,11,0),VLOOKUP(C17,'[1]Din Rep'!$C:$M,10,0)),\"\")","v":0},{"$f":"IFERROR(IFERROR(VLOOKUP(B17,'[1]Din Rep'!$B:$M,12,0),VLOOKUP(C17,'[1]Din Rep'!$C:$M,11,0)),\"\")","v":"45 DD"}]
[null,"SU001M32USK3A",{"$f":"IFERROR(VLOOKUP(B18,'[1]Din Rep'!$B:$M,2,0),\"\")","v":"LONG JOHN MANGA LONGA CHESTZIP 3/2MM MASCULINO ULTRA SKIN 3 A SURF MORMAII"},{"$f":"IFERROR(IFERROR(VLOOKUP(B18,'[1]Din Rep'!$B:$M,5,0),VLOOKUP(C18,'[1]Din Rep'!$C:$M,4,0)),\"\")","v":439.41005000000001},{"$f":"IFERROR(IFERROR(VLOOKUP(B18,'[1]Din Rep'!$B:$M,7,0),VLOOKUP(C18,'[1]Din Rep'!$C:$M,6,0)),\"\")","v":467.45750000000004},{"$f":"IFERROR(IFERROR(VLOOKUP(B18,'[1]Din Rep'!$B:$M,8,0),VLOOKUP(C18,'[1]Din Rep'!$C:$M,7,0)),\"\")","v":1099.9000000000001},{"$f":"IFERROR(IFERROR(VLOOKUP(B18,'[1]Din Rep'!$B:$M,10,0),VLOOKUP(C18,'[1]Din Rep'!$C:$M,9,0)),\"\")","v":2.3529411764705883},{"$f":"IFERROR(IFERROR(VLOOKUP(B18,'[1]Din Rep'!$B:$M,11,0),VLOOKUP(C18,'[1]Din Rep'!$C:$M,10,0)),\"\")","v":0},{"$f":"IFERROR(IFERROR(VLOOKUP(B18,'[1]Din Rep'!$B:$M,12,0),VLOOKUP(C18,'[1]Din Rep'!$C:$M,11,0)),\"\")","v":"45 DD"}]
[null,"SU001M20USK3A",{"$f":"IFERROR(VLOOKUP(B19,'[1]Din Rep'!$B:$M,2,0),\"\")","v":"LONG JOHN MANGA LONGA CHESTZIP 2.0MM MASCULINO ULTRA SKIN 3 A SURF MORMAII"},{"$f":"IFERROR(IFERROR(VLOOKUP(B19,'[1]Din Rep'!$B:$M,5,0),VLOOKUP(C19,'[1]Din Rep'!$C:$M,4,0)),\"\")","v":419.43504999999999},{"$f":"IFERROR(IFERROR(VLOOKUP(B19,'[1]Din Rep'!$B:$M,7,0),VLOOKUP(C19,'[1]Din Rep'!$C:$M,6,0)),\"\")","v":446.20750000000004},{"$f":"IFERROR(IFERROR(VLOOKUP(B19,'[1]Din Rep'!$B:$M,8,0),VLOOKUP(C19,'[1]Din Rep'!$C:$M,7,0)),\"\")","v":1049.9000000000001},{"$f":"IFERROR(IFERROR(VLOOKUP(B19,'[1]Din Rep'!$B:$M,10,0),VLOOKUP(C19,'[1]Din Rep'!$C:$M,9,0)),\"\")","v":2.3529411764705883},{"$f":"IFERROR(IFERROR(VLOOKUP(B19,'[1]Din Rep'!$B:$M,11,0),VLOOKUP(C19,'[1]Din Rep'!$C:$M,10,0)),\"\")","v":0},{"$f":"IFERROR(IFERROR(VLOOKUP(B19,'[1]Din Rep'!$B:$M,12,0),VLOOKUP(C19,'[1]Din Rep'!$C:$M,11,0)),\"\")","v":"45 DD"}]
[null,"SU001M43USK3A",{"$f":"IFERROR(VLOOKUP(B20,'[1]Din Rep'!$B:$M,2,0),\"\")","v":"LONG JOHN MANGA LONGA CHESTZIP 4/3MM MASCULINO ULTRA SKIN 3 A SURF MORMAII"},{"$f":"IFERROR(IFERROR(VLOOKUP(B20,'[1]Din Rep'!$B:$M,5,0),VLOOKUP(C20,'[1]Din Rep'!$C:$M,4,0)),\"\")","v":518.95049999999992},{"$f":"IFERROR(IFERROR(VLOOKUP(B20,'[1]Din Rep'!$B:$M,7,0),VLOOKUP(C20,'[1]Din Rep'!$C:$M,6,0)),\"\")","v":552.07499999999993},{"$f":"IFERROR(IFERROR(VLOOKUP(B20,'[1]Din Rep'!$B:$M,8,0),VLOOKUP(C20,'[1]Din Rep'!$C:$M,7,0)),\"\")","v":1299},{"$f":"IFERROR(IFERROR(VLOOKUP(B20,'[1]Din Rep'!$B:$M,10,0),VLOOKUP(C20,'[1]Din Rep'!$C:$M,9,0)),\"\")","v":2.3529411764705883},{"$f":"IFERROR(IFERROR(VLOOKUP(B20,'[1]Din Rep'!$B:$M,11,0),VLOOKUP(C20,'[1]Din Rep'!$C:$M,10,0)),\"\")","v":0},{"$f":"IFERROR(IFERROR(VLOOKUP(B20,'[1]Din Rep'!$B:$M,12,0),VLOOKUP(C20,'[1]Din Rep'!$C:$M,11,0)),\"\")","v":"45 DD"}]
[null,"SU005M20USK3A",{"$f":"IFERROR(VLOOKUP(B21,'[1]Din Rep'!$B:$M,2,0),\"\")","v":"SHORT JOHN MANGA LONGA CHESTZIP 2.0MM MASCULINO ULTRA SKIN 3 A SURF MORMAII"},{"$f":"IFERROR(IFERROR(VLOOKUP(B21,'[1]Din Rep'!$B:$M,5,0),VLOOKUP(C21,'[1]Din Rep'!$C:$M,4,0)),\"\")","v":327.19049999999999},{"$f":"IFERROR(IFERROR(VLOOKUP(B21,'[1]Din Rep'!$B:$M,7,0),VLOOKUP(C21,'[1]Din Rep'!$C:$M,6,0)),\"\")","v":348.07499999999999},{"$f":"IFERROR(IFERROR(VLOOKUP(B21,'[1]Din Rep'!$B:$M,8,0),VLOOKUP(C21,'[1]Din Rep'!$C:$M,7,0)),\"\")","v":819},{"$f":"IFERROR(IFERROR(VLOOKUP(B21,'[1]Din Rep'!$B:$M,10,0),VLOOKUP(C21,'[1]Din Rep'!$C:$M,9,0)),\"\")","v":2.3529411764705883},{"$f":"IFERROR(IFERROR(VLOOKUP(B21,'[1]Din Rep'!$B:$M,11,0),VLOOKUP(C21,'[1]Din Rep'!$C:$M,10,0)),\"\")","v":0},{"$f":"IFERROR(IFERROR(VLOOKUP(B21,'[1]Din Rep'!$B:$M,12,0),VLOOKUP(C21,'[1]Din Rep'!$C:$M,11,0)),\"\")","v":"45 DD"}]
[null,"SU037M00USK3A",{"$f":"IFERROR(VLOOKUP(B22,'[1]Din Rep'!$B:$M,2,0),\"\")","v":"CAMISETA MANGA LONGA RAGLAN DE LYCRA MASCULINO ULTRA SKIN 3 A UV CORE MORMAII"},{"$f":"IFERROR(IFERROR(VLOOKUP(B22,'[1]Din Rep'!$B:$M,5,0),VLOOKUP(C22,'[1]Din Rep'!$C:$M,4,0)),\"\")","v":79.860049999999987},{"$f":"IFERROR(IFERROR(VLOOKUP(B22,'[1]Din Rep'!$B:$M,7,0),VLOOKUP(C22,'[1]Din Rep'!$C:$M,6,0)),\"\")","v":84.957499999999996},{"$f":"IFERROR(IFERROR(VLOOKUP(B22,'[1]Din Rep'!$B:$M,8,0),VLOOKUP(C22,'[1]Din Rep'!$C:$M,7,0)),\"\")","v":199.9},{"$f":"IFERROR(IFERROR(VLOOKUP(B22,'[1]Din Rep'!$B:$M,10,0),VLOOKUP(C22,'[1]Din Rep'!$C:$M,9,0)),\"\")","v":2.3529411764705883},{"$f":"IFERROR(IFERROR(VLOOKUP(B22,'[1]Din Rep'!$B:$M,11,0),VLOOKUP(C22,'[1]Din Rep'!$C:$M,10,0)),\"\")","v":0},{"$f":"IFERROR(IFERROR(VLOOKUP(B22,'[1]Din Rep'!$B:$M,12,0),VLOOKUP(C22,'[1]Din Rep'!$C:$M,11,0)),\"\")","v":"45 DD"}]
["3 - TOW SUITS","SU001M32TWN1A",{"$f":"IFERROR(VLOOKUP(B23,'[1]Din Rep'!$B:$M,2,0),\"\")","v":"LONG JOHN  MANGA LONGA BACKZIP COM FLUTUAÇÃO 3/2MM MASCULINO TOW IN 1 A SURF MORMAII"},{"$f":"IFERROR(IFERROR(VLOOKUP(B23,'[1]Din Rep'!$B:$M,5,0),VLOOKUP(C23,'[1]Din Rep'!$C:$M,4,0)),\"\")","v":1677.8600499999998},{"$f":"IFERROR(IFERROR(VLOOKUP(B23,'[1]Din Rep'!$B:$M,7,0),VLOOKUP(C23,'[1]Din Rep'!$C:$M,6,0)),\"\")","v":1784.9574999999998},{"$f":"IFERROR(IFERROR(VLOOKUP(B23,'[1]Din Rep'!$B:$M,8,0),VLOOKUP(C23,'[1]Din Rep'!$C:$M,7,0)),\"\")","v":4199.8999999999996},{"$f":"IFERROR(IFERROR(VLOOKUP(B23,'[1]Din Rep'!$B:$M,10,0),VLOOKUP(C23,'[1]Din Rep'!$C:$M,9,0)),\"\")","v":2.3529411764705883},{"$f":"IFERROR(IFERROR(VLOOKUP(B23,'[1]Din Rep'!$B:$M,11,0),VLOOKUP(C23,'[1]Din Rep'!$C:$M,10,0)),\"\")","v":0},{"$f":"IFERROR(IFERROR(VLOOKUP(B23,'[1]Din Rep'!$B:$M,12,0),VLOOKUP(C23,'[1]Din Rep'!$C:$M,11,0)),\"\")","v":"45 DD"}]
[null,"SU005M20TWN1A",{"$f":"IFERROR(VLOOKUP(B24,'[1]Din Rep'!$B:$M,2,0),\"\")","v":"SHORT JOHN  MANGA LONGA BACKZIP COM FLUTUAÇÃO 2/2MM MASCULINO TOW IN 1 A SURF MORMAII"},{"$f":"IFERROR(IFERROR(VLOOKUP(B24,'[1]Din Rep'!$B:$M,5,0),VLOOKUP(C24,'[1]Din Rep'!$C:$M,4,0)),\"\")","v":1278.36005},{"$f":"IFERROR(IFERROR(VLOOKUP(B24,'[1]Din Rep'!$B:$M,7,0),VLOOKUP(C24,'[1]Din Rep'!$C:$M,6,0)),\"\")","v":1359.9575},{"$f":"IFERROR(IFERROR(VLOOKUP(B24,'[1]Din Rep'!$B:$M,8,0),VLOOKUP(C24,'[1]Din Rep'!$C:$M,7,0)),\"\")","v":3199.9},{"$f":"IFERROR(IFERROR(VLOOKUP(B24,'[1]Din Rep'!$B:$M,10,0),VLOOKUP(C24,'[1]Din Rep'!$C:$M,9,0)),\"\")","v":2.3529411764705883},{"$f":"IFERROR(IFERROR(VLOOKUP(B24,'[1]Din Rep'!$B:$M,11,0),VLOOKUP(C24,'[1]Din Rep'!$C:$M,10,0)),\"\")","v":0},{"$f":"IFERROR(IFERROR(VLOOKUP(B24,'[1]Din Rep'!$B:$M,12,0),VLOOKUP(C24,'[1]Din Rep'!$C:$M,11,0)),\"\")","v":"45 DD"}]
["4 - EXTRA LINE","SU001M32EXL3A",{"$f":"IFERROR(VLOOKUP(B25,'[1]Din Rep'!$B:$M,2,0),\"\")","v":"LONG JOHN  MANGA LONGA BACKZIP 3/2MM MASCULINO EXTRA LINE 3 A SURF MORMAII"},{"$f":"IFERROR(IFERROR(VLOOKUP(B25,'[1]Din Rep'!$B:$M,5,0),VLOOKUP(C25,'[1]Din Rep'!$C:$M,4,0)),\"\")","v":279.61004999999994},{"$f":"IFERROR(IFERROR(VLOOKUP(B25,'[1]Din Rep'!$B:$M,7,0),VLOOKUP(C25,'[1]Din Rep'!$C:$M,6,0)),\"\")","v":297.45749999999998},{"$f":"IFERROR(IFERROR(VLOOKUP(B25,'[1]Din Rep'!$B:$M,8,0),VLOOKUP(C25,'[1]Din Rep'!$C:$M,7,0)),\"\")","v":699.9},{"$f":"IFERROR(IFERROR(VLOOKUP(B25,'[1]Din Rep'!$B:$M,10,0),VLOOKUP(C25,'[1]Din Rep'!$C:$M,9,0)),\"\")","v":2.3529411764705883},{"$f":"IFERROR(IFERROR(VLOOKUP(B25,'[1]Din Rep'!$B:$M,11,0),VLOOKUP(C25,'[1]Din Rep'!$C:$M,10,0)),\"\")","v":0},{"$f":"IFERROR(IFERROR(VLOOKUP(B25,'[1]Din Rep'!$B:$M,12,0),VLOOKUP(C25,'[1]Din Rep'!$C:$M,11,0)),\"\")","v":"45 DD"}]
[null,"SU001M20EXL3A",{"$f":"IFERROR(VLOOKUP(B26,'[1]Din Rep'!$B:$M,2,0),\"\")","v":"LONG JOHN MANGA LONGA BACKZIP 2.0MM MASCULINO EXTRA LINE 3 A SURF MORMAII"},{"$f":"IFERROR(IFERROR(VLOOKUP(B26,'[1]Din Rep'!$B:$M,5,0),VLOOKUP(C26,'[1]Din Rep'!$C:$M,4,0)),\"\")","v":271.62004999999999},{"$f":"IFERROR(IFERROR(VLOOKUP(B26,'[1]Din Rep'!$B:$M,7,0),VLOOKUP(C26,'[1]Din Rep'!$C:$M,6,0)),\"\")","v":288.95749999999998},{"$f":"IFERROR(IFERROR(VLOOKUP(B26,'[1]Din Rep'!$B:$M,8,0),VLOOKUP(C26,'[1]Din Rep'!$C:$M,7,0)),\"\")","v":679.9},{"$f":"IFERROR(IFERROR(VLOOKUP(B26,'[1]Din Rep'!$B:$M,10,0),VLOOKUP(C26,'[1]Din Rep'!$C:$M,9,0)),\"\")","v":2.3529411764705883},{"$f":"IFERROR(IFERROR(VLOOKUP(B26,'[1]Din Rep'!$B:$M,11,0),VLOOKUP(C26,'[1]Din Rep'!$C:$M,10,0)),\"\")","v":0},{"$f":"IFERROR(IFERROR(VLOOKUP(B26,'[1]Din Rep'!$B:$M,12,0),VLOOKUP(C26,'[1]Din Rep'!$C:$M,11,0)),\"\")","v":"45 DD"}]
[null,"SU005M20EXL3A",{"$f":"IFERROR(VLOOKUP(B27,'[1]Din Rep'!$B:$M,2,0),\"\")","v":"SHORT JOHN MANGA LONGA BACKZIP 2.0MM MASCULINO EXTRA LINE 3 A SURF MORMAII"},{"$f":"IFERROR(IFERROR(VLOOKUP(B27,'[1]Din Rep'!$B:$M,5,0),VLOOKUP(C27,'[1]Din Rep'!$C:$M,4,0)),\"\")","v":219.68504999999996},{"$f":"IFERROR(IFERROR(VLOOKUP(B27,'[1]Din Rep'!$B:$M,7,0),VLOOKUP(C27,'[1]Din Rep'!$C:$M,6,0)),\"\")","v":233.70749999999998},{"$f":"IFERROR(IFERROR(VLOOKUP(B27,'[1]Din Rep'!$B:$M,8,0),VLOOKUP(C27,'[1]Din Rep'!$C:$M,7,0)),\"\")","v":549.9},{"$f":"IFERROR(IFERROR(VLOOKUP(B27,'[1]Din Rep'!$B:$M,10,0),VLOOKUP(C27,'[1]Din Rep'!$C:$M,9,0)),\"\")","v":2.3529411764705883},{"$f":"IFERROR(IFERROR(VLOOKUP(B27,'[1]Din Rep'!$B:$M,11,0),VLOOKUP(C27,'[1]Din Rep'!$C:$M,10,0)),\"\")","v":0},{"$f":"IFERROR(IFERROR(VLOOKUP(B27,'[1]Din Rep'!$B:$M,12,0),VLOOKUP(C27,'[1]Din Rep'!$C:$M,11,0)),\"\")","v":"45 DD"}]
[null,"SU006M20EXL3A",{"$f":"IFERROR(VLOOKUP(B28,'[1]Din Rep'!$B:$M,2,0),\"\")","v":"SHORT JOHN MANGA CURTA BACKZIP 2.0MM MASCULINO EXTRA LINE 3 A SURF MORMAII"},{"$f":"IFERROR(IFERROR(VLOOKUP(B28,'[1]Din Rep'!$B:$M,5,0),VLOOKUP(C28,'[1]Din Rep'!$C:$M,4,0)),\"\")","v":199.71004999999997},{"$f":"IFERROR(IFERROR(VLOOKUP(B28,'[1]Din Rep'!$B:$M,7,0),VLOOKUP(C28,'[1]Din Rep'!$C:$M,6,0)),\"\")","v":212.45749999999998},{"$f":"IFERROR(IFERROR(VLOOKUP(B28,'[1]Din Rep'!$B:$M,8,0),VLOOKUP(C28,'[1]Din Rep'!$C:$M,7,0)),\"\")","v":499.9},{"$f":"IFERROR(IFERROR(VLOOKUP(B28,'[1]Din Rep'!$B:$M,10,0),VLOOKUP(C28,'[1]Din Rep'!$C:$M,9,0)),\"\")","v":2.3529411764705883},{"$f":"IFERROR(IFERROR(VLOOKUP(B28,'[1]Din Rep'!$B:$M,11,0),VLOOKUP(C28,'[1]Din Rep'!$C:$M,10,0)),\"\")","v":0},{"$f":"IFERROR(IFERROR(VLOOKUP(B28,'[1]Din Rep'!$B:$M,12,0),VLOOKUP(C28,'[1]Din Rep'!$C:$M,11,0)),\"\")","v":"45 DD"}]
[null,"SU007M10EXL3A",{"$f":"IFERROR(VLOOKUP(B29,'[1]Din Rep'!$B:$M,2,0),\"\")","v":"SHORT JOHN SEM MANGA SNAP SHOULDER 1.0MM MASCULINO EXTRA LINE 3 A SURF MORMAII"},{"$f":"IFERROR(IFERROR(VLOOKUP(B29,'[1]Din Rep'!$B:$M,5,0),VLOOKUP(C29,'[1]Din Rep'!$C:$M,4,0)),\"\")","v":167.75004999999999},{"$f":"IFERROR(IFERROR(VLOOKUP(B29,'[1]Din Rep'!$B:$M,7,0),VLOOKUP(C29,'[1]Din Rep'!$C:$M,6,0)),\"\")","v":178.45749999999998},{"$f":"IFERROR(IFERROR(VLOOKUP(B29,'[1]Din Rep'!$B:$M,8,0),VLOOKUP(C29,'[1]Din Rep'!$C:$M,7,0)),\"\")","v":419.9},{"$f":"IFERROR(IFERROR(VLOOKUP(B29,'[1]Din Rep'!$B:$M,10,0),VLOOKUP(C29,'[1]Din Rep'!$C:$M,9,0)),\"\")","v":2.3529411764705883},{"$f":"IFERROR(IFERROR(VLOOKUP(B29,'[1]Din Rep'!$B:$M,11,0),VLOOKUP(C29,'[1]Din Rep'!$C:$M,10,0)),\"\")","v":0},{"$f":"IFERROR(IFERROR(VLOOKUP(B29,'[1]Din Rep'!$B:$M,12,0),VLOOKUP(C29,'[1]Din Rep'!$C:$M,11,0)),\"\")","v":"45 DD"}]
[null,"SU040M10EXL3A",{"$f":"IFERROR(VLOOKUP(B30,'[1]Din Rep'!$B:$M,2,0),\"\")","v":"CAMISETA MANGA LONGA C/ NEOPRENE NEOLYCRA 1.0MM MASCULINO EXTRA LINE 3 A SURF MORMAII"},{"$f":"IFERROR(IFERROR(VLOOKUP(B30,'[1]Din Rep'!$B:$M,5,0),VLOOKUP(C30,'[1]Din Rep'!$C:$M,4,0)),\"\")","v":111.82004999999998},{"$f":"IFERROR(IFERROR(VLOOKUP(B30,'[1]Din Rep'!$B:$M,7,0),VLOOKUP(C30,'[1]Din Rep'!$C:$M,6,0)),\"\")","v":118.95749999999998},{"$f":"IFERROR(IFERROR(VLOOKUP(B30,'[1]Din Rep'!$B:$M,8,0),VLOOKUP(C30,'[1]Din Rep'!$C:$M,7,0)),\"\")","v":279.89999999999998},{"$f":"IFERROR(IFERROR(VLOOKUP(B30,'[1]Din Rep'!$B:$M,10,0),VLOOKUP(C30,'[1]Din Rep'!$C:$M,9,0)),\"\")","v":2.3529411764705883},{"$f":"IFERROR(IFERROR(VLOOKUP(B30,'[1]Din Rep'!$B:$M,11,0),VLOOKUP(C30,'[1]Din Rep'!$C:$M,10,0)),\"\")","v":0},{"$f":"IFERROR(IFERROR(VLOOKUP(B30,'[1]Din Rep'!$B:$M,12,0),VLOOKUP(C30,'[1]Din Rep'!$C:$M,11,0)),\"\")","v":"45 DD"}]
[null,"SU037M00EXL3A",{"$f":"IFERROR(VLOOKUP(B31,'[1]Din Rep'!$B:$M,2,0),\"\")","v":"CAMISETA MANGA LONGA LYCRA MASCULINO EXTRA LINE 3 A UV CORE MORMAII"},{"$f":"IFERROR(IFERROR(VLOOKUP(B31,'[1]Din Rep'!$B:$M,5,0),VLOOKUP(C31,'[1]Din Rep'!$C:$M,4,0)),\"\")","v":67.875049999999987},{"$f":"IFERROR(IFERROR(VLOOKUP(B31,'[1]Din Rep'!$B:$M,7,0),VLOOKUP(C31,'[1]Din Rep'!$C:$M,6,0)),\"\")","v":72.207499999999996},{"$f":"IFERROR(IFERROR(VLOOKUP(B31,'[1]Din Rep'!$B:$M,8,0),VLOOKUP(C31,'[1]Din Rep'!$C:$M,7,0)),\"\")","v":169.9},{"$f":"IFERROR(IFERROR(VLOOKUP(B31,'[1]Din Rep'!$B:$M,10,0),VLOOKUP(C31,'[1]Din Rep'!$C:$M,9,0)),\"\")","v":2.3529411764705883},{"$f":"IFERROR(IFERROR(VLOOKUP(B31,'[1]Din Rep'!$B:$M,11,0),VLOOKUP(C31,'[1]Din Rep'!$C:$M,10,0)),\"\")","v":0},{"$f":"IFERROR(IFERROR(VLOOKUP(B31,'[1]Din Rep'!$B:$M,12,0),VLOOKUP(C31,'[1]Din Rep'!$C:$M,11,0)),\"\")","v":"45 DD"}]
[null,"SU041M00EXL3A",{"$f":"IFERROR(VLOOKUP(B32,'[1]Din Rep'!$B:$M,2,0),\"\")","v":"CAMISETA MANGA CURTA LYCRA MASCULINO EXTRA LINE 3 A UV CORE MORMAII"},{"$f":"IFERROR(IFERROR(VLOOKUP(B32,'[1]Din Rep'!$B:$M,5,0),VLOOKUP(C32,'[1]Din Rep'!$C:$M,4,0)),\"\")","v":59.88505},{"$f":"IFERROR(IFERROR(VLOOKUP(B32,'[1]Din Rep'!$B:$M,7,0),VLOOKUP(C32,'[1]Din Rep'!$C:$M,6,0)),\"\")","v":63.707500000000003},{"$f":"IFERROR(IFERROR(VLOOKUP(B32,'[1]Din Rep'!$B:$M,8,0),VLOOKUP(C32,'[1]Din Rep'!$C:$M,7,0)),\"\")","v":149.9},{"$f":"IFERROR(IFERROR(VLOOKUP(B32,'[1]Din Rep'!$B:$M,10,0),VLOOKUP(C32,'[1]Din Rep'!$C:$M,9,0)),\"\")","v":2.3529411764705883},{"$f":"IFERROR(IFERROR(VLOOKUP(B32,'[1]Din Rep'!$B:$M,11,0),VLOOKUP(C32,'[1]Din Rep'!$C:$M,10,0)),\"\")","v":0},{"$f":"IFERROR(IFERROR(VLOOKUP(B32,'[1]Din Rep'!$B:$M,12,0),VLOOKUP(C32,'[1]Din Rep'!$C:$M,11,0)),\"\")","v":"45 DD"}]
["5 - DIVA PRO","SU001F32DVP6A",{"$f":"IFERROR(VLOOKUP(B33,'[1]Din Rep'!$B:$M,2,0),\"\")","v":"LONG JOHN MANGA LONGA CHESTZIP 3/2 MM FEMININO DIVA PRO 6 A SURF MORMAII"},{"$f":"IFERROR(IFERROR(VLOOKUP(B33,'[1]Din Rep'!$B:$M,5,0),VLOOKUP(C33,'[1]Din Rep'!$C:$M,4,0)),\"\")","v":439.41005000000001},{"$f":"IFERROR(IFERROR(VLOOKUP(B33,'[1]Din Rep'!$B:$M,7,0),VLOOKUP(C33,'[1]Din Rep'!$C:$M,6,0)),\"\")","v":467.45750000000004},{"$f":"IFERROR(IFERROR(VLOOKUP(B33,'[1]Din Rep'!$B:$M,8,0),VLOOKUP(C33,'[1]Din Rep'!$C:$M,7,0)),\"\")","v":1099.9000000000001},{"$f":"IFERROR(IFERROR(VLOOKUP(B33,'[1]Din Rep'!$B:$M,10,0),VLOOKUP(C33,'[1]Din Rep'!$C:$M,9,0)),\"\")","v":2.3529411764705883},{"$f":"IFERROR(IFERROR(VLOOKUP(B33,'[1]Din Rep'!$B:$M,11,0),VLOOKUP(C33,'[1]Din Rep'!$C:$M,10,0)),\"\")","v":0},{"$f":"IFERROR(IFERROR(VLOOKUP(B33,'[1]Din Rep'!$B:$M,12,0),VLOOKUP(C33,'[1]Din Rep'!$C:$M,11,0)),\"\")","v":"45 DD"}]
[null,"SU001F10DVP6A",{"$f":"IFERROR(VLOOKUP(B34,'[1]Din Rep'!$B:$M,2,0),\"\")","v":"LONG JOHN MANGA LONGA CHESTZIP 1 MM FEMININO DIVA PRO 6 A SURF MORMAII"},{"$f":"IFERROR(IFERROR(VLOOKUP(B34,'[1]Din Rep'!$B:$M,5,0),VLOOKUP(C34,'[1]Din Rep'!$C:$M,4,0)),\"\")","v":279.61004999999994},{"$f":"IFERROR(IFERROR(VLOOKUP(B34,'[1]Din Rep'!$B:$M,7,0),VLOOKUP(C34,'[1]Din Rep'!$C:$M,6,0)),\"\")","v":297.45749999999998},{"$f":"IFERROR(IFERROR(VLOOKUP(B34,'[1]Din Rep'!$B:$M,8,0),VLOOKUP(C34,'[1]Din Rep'!$C:$M,7,0)),\"\")","v":699.9},{"$f":"IFERROR(IFERROR(VLOOKUP(B34,'[1]Din Rep'!$B:$M,10,0),VLOOKUP(C34,'[1]Din Rep'!$C:$M,9,0)),\"\")","v":2.3529411764705883},{"$f":"IFERROR(IFERROR(VLOOKUP(B34,'[1]Din Rep'!$B:$M,11,0),VLOOKUP(C34,'[1]Din Rep'!$C:$M,10,0)),\"\")","v":0},{"$f":"IFERROR(IFERROR(VLOOKUP(B34,'[1]Din Rep'!$B:$M,12,0),VLOOKUP(C34,'[1]Din Rep'!$C:$M,11,0)),\"\")","v":"45 DD"}]
[null,"SU005F10DVP6A",{"$f":"IFERROR(VLOOKUP(B35,'[1]Din Rep'!$B:$M,2,0),\"\")","v":"SHORT JOHN MANGA LONGA FRONTZIP 1.5MM FEMININO DIVA PRO 6 A SURF MORMAII "},{"$f":"IFERROR(IFERROR(VLOOKUP(B35,'[1]Din Rep'!$B:$M,5,0),VLOOKUP(C35,'[1]Din Rep'!$C:$M,4,0)),\"\")","v":191.72004999999996},{"$f":"IFERROR(IFERROR(VLOOKUP(B35,'[1]Din Rep'!$B:$M,7,0),VLOOKUP(C35,'[1]Din Rep'!$C:$M,6,0)),\"\")","v":203.95749999999998},{"$f":"IFERROR(IFERROR(VLOOKUP(B35,'[1]Din Rep'!$B:$M,8,0),VLOOKUP(C35,'[1]Din Rep'!$C:$M,7,0)),\"\")","v":479.9},{"$f":"IFERROR(IFERROR(VLOOKUP(B35,'[1]Din Rep'!$B:$M,10,0),VLOOKUP(C35,'[1]Din Rep'!$C:$M,9,0)),\"\")","v":2.3529411764705883},{"$f":"IFERROR(IFERROR(VLOOKUP(B35,'[1]Din Rep'!$B:$M,11,0),VLOOKUP(C35,'[1]Din Rep'!$C:$M,10,0)),\"\")","v":0},{"$f":"IFERROR(IFERROR(VLOOKUP(B35,'[1]Din Rep'!$B:$M,12,0),VLOOKUP(C35,'[1]Din Rep'!$C:$M,11,0)),\"\")","v":"45 DD"}]
[null,"SU037F00DVP6A",{"$f":"IFERROR(VLOOKUP(B36,'[1]Din Rep'!$B:$M,2,0),\"\")","v":"CAMISETA MANGA LONGA LYCRA FEMININO DIVA PRO 6 A UV CORE MORMAII"},{"$f":"IFERROR(IFERROR(VLOOKUP(B36,'[1]Din Rep'!$B:$M,5,0),VLOOKUP(C36,'[1]Din Rep'!$C:$M,4,0)),\"\")","v":79.860049999999987},{"$f":"IFERROR(IFERROR(VLOOKUP(B36,'[1]Din Rep'!$B:$M,7,0),VLOOKUP(C36,'[1]Din Rep'!$C:$M,6,0)),\"\")","v":84.957499999999996},{"$f":"IFERROR(IFERROR(VLOOKUP(B36,'[1]Din Rep'!$B:$M,8,0),VLOOKUP(C36,'[1]Din Rep'!$C:$M,7,0)),\"\")","v":199.9},{"$f":"IFERROR(IFERROR(VLOOKUP(B36,'[1]Din Rep'!$B:$M,10,0),VLOOKUP(C36,'[1]Din Rep'!$C:$M,9,0)),\"\")","v":2.3529411764705883},{"$f":"IFERROR(IFERROR(VLOOKUP(B36,'[1]Din Rep'!$B:$M,11,0),VLOOKUP(C36,'[1]Din Rep'!$C:$M,10,0)),\"\")","v":0},{"$f":"IFERROR(IFERROR(VLOOKUP(B36,'[1]Din Rep'!$B:$M,12,0),VLOOKUP(C36,'[1]Din Rep'!$C:$M,11,0)),\"\")","v":"45 DD"}]
[null,"SU054F10DVP6A",{"$f":"IFERROR(VLOOKUP(B37,'[1]Din Rep'!$B:$M,2,0),\"\")","v":"BERMUDA 1.0MM FEMININO DIVA PRO 6 A SURF MORMAII"},{"$f":"IFERROR(IFERROR(VLOOKUP(B37,'[1]Din Rep'!$B:$M,5,0),VLOOKUP(C37,'[1]Din Rep'!$C:$M,4,0)),\"\")","v":71.870049999999992},{"$f":"IFERROR(IFERROR(VLOOKUP(B37,'[1]Din Rep'!$B:$M,7,0),VLOOKUP(C37,'[1]Din Rep'!$C:$M,6,0)),\"\")","v":76.457499999999996},{"$f":"IFERROR(IFERROR(VLOOKUP(B37,'[1]Din Rep'!$B:$M,8,0),VLOOKUP(C37,'[1]Din Rep'!$C:$M,7,0)),\"\")","v":179.9},{"$f":"IFERROR(IFERROR(VLOOKUP(B37,'[1]Din Rep'!$B:$M,10,0),VLOOKUP(C37,'[1]Din Rep'!$C:$M,9,0)),\"\")","v":2.3529411764705883},{"$f":"IFERROR(IFERROR(VLOOKUP(B37,'[1]Din Rep'!$B:$M,11,0),VLOOKUP(C37,'[1]Din Rep'!$C:$M,10,0)),\"\")","v":0},{"$f":"IFERROR(IFERROR(VLOOKUP(B37,'[1]Din Rep'!$B:$M,12,0),VLOOKUP(C37,'[1]Din Rep'!$C:$M,11,0)),\"\")","v":"45 DD"}]
[null,"SU023F00DVP6A",{"$f":"IFERROR(VLOOKUP(B38,'[1]Din Rep'!$B:$M,2,0),\"\")","v":"MAIO FEMININO EL LYCRA C/ FORRO DIVA PRO 6 A SURF MORMAII"},{"$f":"IFERROR(IFERROR(VLOOKUP(B38,'[1]Din Rep'!$B:$M,5,0),VLOOKUP(C38,'[1]Din Rep'!$C:$M,4,0)),\"\")","v":71.870049999999992},{"$f":"IFERROR(IFERROR(VLOOKUP(B38,'[1]Din Rep'!$B:$M,7,0),VLOOKUP(C38,'[1]Din Rep'!$C:$M,6,0)),\"\")","v":76.457499999999996},{"$f":"IFERROR(IFERROR(VLOOKUP(B38,'[1]Din Rep'!$B:$M,8,0),VLOOKUP(C38,'[1]Din Rep'!$C:$M,7,0)),\"\")","v":179.9},{"$f":"IFERROR(IFERROR(VLOOKUP(B38,'[1]Din Rep'!$B:$M,10,0),VLOOKUP(C38,'[1]Din Rep'!$C:$M,9,0)),\"\")","v":2.3529411764705883},{"$f":"IFERROR(IFERROR(VLOOKUP(B38,'[1]Din Rep'!$B:$M,11,0),VLOOKUP(C38,'[1]Din Rep'!$C:$M,10,0)),\"\")","v":0},{"$f":"IFERROR(IFERROR(VLOOKUP(B38,'[1]Din Rep'!$B:$M,12,0),VLOOKUP(C38,'[1]Din Rep'!$C:$M,11,0)),\"\")","v":"45 DD"}]
[null,"SU052F00DVP6A",{"$f":"IFERROR(VLOOKUP(B39,'[1]Din Rep'!$B:$M,2,0),\"\")","v":"TOP FEMININO EM LYCRA C/ FORRO DIVA PRO 6 A SURF MORMAII"},{"$f":"IFERROR(IFERROR(VLOOKUP(B39,'[1]Din Rep'!$B:$M,5,0),VLOOKUP(C39,'[1]Din Rep'!$C:$M,4,0)),\"\")","v":39.910049999999998},{"$f":"IFERROR(IFERROR(VLOOKUP(B39,'[1]Din Rep'!$B:$M,7,0),VLOOKUP(C39,'[1]Din Rep'!$C:$M,6,0)),\"\")","v":42.457500000000003},{"$f":"IFERROR(IFERROR(VLOOKUP(B39,'[1]Din Rep'!$B:$M,8,0),VLOOKUP(C39,'[1]Din Rep'!$C:$M,7,0)),\"\")","v":99.9},{"$f":"IFERROR(IFERROR(VLOOKUP(B39,'[1]Din Rep'!$B:$M,10,0),VLOOKUP(C39,'[1]Din Rep'!$C:$M,9,0)),\"\")","v":2.3529411764705883},{"$f":"IFERROR(IFERROR(VLOOKUP(B39,'[1]Din Rep'!$B:$M,11,0),VLOOKUP(C39,'[1]Din Rep'!$C:$M,10,0)),\"\")","v":0},{"$f":"IFERROR(IFERROR(VLOOKUP(B39,'[1]Din Rep'!$B:$M,12,0),VLOOKUP(C39,'[1]Din Rep'!$C:$M,11,0)),\"\")","v":"45 DD"}]
[null,"SU081F00DVP6A",{"$f":"IFERROR(VLOOKUP(B40,'[1]Din Rep'!$B:$M,2,0),\"\")","v":"SUNKINI FEMININO EM LYCRA S/ FORRO DIVA PRO 6 A SURF MORMAII"},{"$f":"IFERROR(IFERROR(VLOOKUP(B40,'[1]Din Rep'!$B:$M,5,0),VLOOKUP(C40,'[1]Din Rep'!$C:$M,4,0)),\"\")","v":39.910049999999998},{"$f":"IFERROR(IFERROR(VLOOKUP(B40,'[1]Din Rep'!$B:$M,7,0),VLOOKUP(C40,'[1]Din Rep'!$C:$M,6,0)),\"\")","v":42.457500000000003},{"$f":"IFERROR(IFERROR(VLOOKUP(B40,'[1]Din Rep'!$B:$M,8,0),VLOOKUP(C40,'[1]Din Rep'!$C:$M,7,0)),\"\")","v":99.9},{"$f":"IFERROR(IFERROR(VLOOKUP(B40,'[1]Din Rep'!$B:$M,10,0),VLOOKUP(C40,'[1]Din Rep'!$C:$M,9,0)),\"\")","v":2.3529411764705883},{"$f":"IFERROR(IFERROR(VLOOKUP(B40,'[1]Din Rep'!$B:$M,11,0),VLOOKUP(C40,'[1]Din Rep'!$C:$M,10,0)),\"\")","v":0},{"$f":"IFERROR(IFERROR(VLOOKUP(B40,'[1]Din Rep'!$B:$M,12,0),VLOOKUP(C40,'[1]Din Rep'!$C:$M,11,0)),\"\")","v":"45 DD"}]
[null,"SU021F00DVP6A",{"$f":"IFERROR(VLOOKUP(B41,'[1]Din Rep'!$B:$M,2,0),\"\")","v":"BODY MANGA LONGA FEMININO EM LYCRA C/ FORRO DIVA PRO 6 A SURF MORMAII"},{"$f":"IFERROR(IFERROR(VLOOKUP(B41,'[1]Din Rep'!$B:$M,5,0),VLOOKUP(C41,'[1]Din Rep'!$C:$M,4,0)),\"\")","v":79.860049999999987},{"$f":"IFERROR(IFERROR(VLOOKUP(B41,'[1]Din Rep'!$B:$M,7,0),VLOOKUP(C41,'[1]Din Rep'!$C:$M,6,0)),\"\")","v":84.957499999999996},{"$f":"IFERROR(IFERROR(VLOOKUP(B41,'[1]Din Rep'!$B:$M,8,0),VLOOKUP(C41,'[1]Din Rep'!$C:$M,7,0)),\"\")","v":199.9},{"$f":"IFERROR(IFERROR(VLOOKUP(B41,'[1]Din Rep'!$B:$M,10,0),VLOOKUP(C41,'[1]Din Rep'!$C:$M,9,0)),\"\")","v":2.3529411764705883},{"$f":"IFERROR(IFERROR(VLOOKUP(B41,'[1]Din Rep'!$B:$M,11,0),VLOOKUP(C41,'[1]Din Rep'!$C:$M,10,0)),\"\")","v":0},{"$f":"IFERROR(IFERROR(VLOOKUP(B41,'[1]Din Rep'!$B:$M,12,0),VLOOKUP(C41,'[1]Din Rep'!$C:$M,11,0)),\"\")","v":"45 DD"}]
["6 - DIVA","SU001F32DIV7A",{"$f":"IFERROR(VLOOKUP(B42,'[1]Din Rep'!$B:$M,2,0),\"\")","v":"LONG JOHN MANGA LONGA BACKZIP 3/2 MM FEMININO DIVA 7 A SURF MORMAII "},{"$f":"IFERROR(IFERROR(VLOOKUP(B42,'[1]Din Rep'!$B:$M,5,0),VLOOKUP(C42,'[1]Din Rep'!$C:$M,4,0)),\"\")","v":279.61004999999994},{"$f":"IFERROR(IFERROR(VLOOKUP(B42,'[1]Din Rep'!$B:$M,7,0),VLOOKUP(C42,'[1]Din Rep'!$C:$M,6,0)),\"\")","v":297.45749999999998},{"$f":"IFERROR(IFERROR(VLOOKUP(B42,'[1]Din Rep'!$B:$M,8,0),VLOOKUP(C42,'[1]Din Rep'!$C:$M,7,0)),\"\")","v":699.9},{"$f":"IFERROR(IFERROR(VLOOKUP(B42,'[1]Din Rep'!$B:$M,10,0),VLOOKUP(C42,'[1]Din Rep'!$C:$M,9,0)),\"\")","v":2.3529411764705883},{"$f":"IFERROR(IFERROR(VLOOKUP(B42,'[1]Din Rep'!$B:$M,11,0),VLOOKUP(C42,'[1]Din Rep'!$C:$M,10,0)),\"\")","v":0},{"$f":"IFERROR(IFERROR(VLOOKUP(B42,'[1]Din Rep'!$B:$M,12,0),VLOOKUP(C42,'[1]Din Rep'!$C:$M,11,0)),\"\")","v":"45 DD"}]
[null,"SU001F20DIV7A",{"$f":"IFERROR(VLOOKUP(B43,'[1]Din Rep'!$B:$M,2,0),\"\")","v":"LONG JOHN MANGA LONGA BACKZIP 2MM FEMININO DIVA 7A SURF MORMAII"},{"$f":"IFERROR(IFERROR(VLOOKUP(B43,'[1]Din Rep'!$B:$M,5,0),VLOOKUP(C43,'[1]Din Rep'!$C:$M,4,0)),\"\")","v":271.62004999999999},{"$f":"IFERROR(IFERROR(VLOOKUP(B43,'[1]Din Rep'!$B:$M,7,0),VLOOKUP(C43,'[1]Din Rep'!$C:$M,6,0)),\"\")","v":288.95749999999998},{"$f":"IFERROR(IFERROR(VLOOKUP(B43,'[1]Din Rep'!$B:$M,8,0),VLOOKUP(C43,'[1]Din Rep'!$C:$M,7,0)),\"\")","v":679.9},{"$f":"IFERROR(IFERROR(VLOOKUP(B43,'[1]Din Rep'!$B:$M,10,0),VLOOKUP(C43,'[1]Din Rep'!$C:$M,9,0)),\"\")","v":2.3529411764705883},{"$f":"IFERROR(IFERROR(VLOOKUP(B43,'[1]Din Rep'!$B:$M,11,0),VLOOKUP(C43,'[1]Din Rep'!$C:$M,10,0)),\"\")","v":0},{"$f":"IFERROR(IFERROR(VLOOKUP(B43,'[1]Din Rep'!$B:$M,12,0),VLOOKUP(C43,'[1]Din Rep'!$C:$M,11,0)),\"\")","v":"45 DD"}]
[null,"SU005F20DIV7A",{"$f":"IFERROR(VLOOKUP(B44,'[1]Din Rep'!$B:$M,2,0),\"\")","v":"SHORT JOHN MANGA LONGA BACKZIP 2.0MM FEMININO DIVA 7 A SURF MORMAII "},{"$f":"IFERROR(IFERROR(VLOOKUP(B44,'[1]Din Rep'!$B:$M,5,0),VLOOKUP(C44,'[1]Din Rep'!$C:$M,4,0)),\"\")","v":259.63504999999998},{"$f":"IFERROR(IFERROR(VLOOKUP(B44,'[1]Din Rep'!$B:$M,7,0),VLOOKUP(C44,'[1]Din Rep'!$C:$M,6,0)),\"\")","v":276.20749999999998},{"$f":"IFERROR(IFERROR(VLOOKUP(B44,'[1]Din Rep'!$B:$M,8,0),VLOOKUP(C44,'[1]Din Rep'!$C:$M,7,0)),\"\")","v":649.9},{"$f":"IFERROR(IFERROR(VLOOKUP(B44,'[1]Din Rep'!$B:$M,10,0),VLOOKUP(C44,'[1]Din Rep'!$C:$M,9,0)),\"\")","v":2.3529411764705883},{"$f":"IFERROR(IFERROR(VLOOKUP(B44,'[1]Din Rep'!$B:$M,11,0),VLOOKUP(C44,'[1]Din Rep'!$C:$M,10,0)),\"\")","v":0},{"$f":"IFERROR(IFERROR(VLOOKUP(B44,'[1]Din Rep'!$B:$M,12,0),VLOOKUP(C44,'[1]Din Rep'!$C:$M,11,0)),\"\")","v":"45 DD"}]
[null,"SU006F20DIV7A",{"$f":"IFERROR(VLOOKUP(B45,'[1]Din Rep'!$B:$M,2,0),\"\")","v":"SHORT JOHN MANGA CURTA BACKZIP 2.0MM FEMININO DIVA 7 A SURF MORMAII"},{"$f":"IFERROR(IFERROR(VLOOKUP(B45,'[1]Din Rep'!$B:$M,5,0),VLOOKUP(C45,'[1]Din Rep'!$C:$M,4,0)),\"\")","v":199.71004999999997},{"$f":"IFERROR(IFERROR(VLOOKUP(B45,'[1]Din Rep'!$B:$M,7,0),VLOOKUP(C45,'[1]Din Rep'!$C:$M,6,0)),\"\")","v":212.45749999999998},{"$f":"IFERROR(IFERROR(VLOOKUP(B45,'[1]Din Rep'!$B:$M,8,0),VLOOKUP(C45,'[1]Din Rep'!$C:$M,7,0)),\"\")","v":499.9},{"$f":"IFERROR(IFERROR(VLOOKUP(B45,'[1]Din Rep'!$B:$M,10,0),VLOOKUP(C45,'[1]Din Rep'!$C:$M,9,0)),\"\")","v":2.3529411764705883},{"$f":"IFERROR(IFERROR(VLOOKUP(B45,'[1]Din Rep'!$B:$M,11,0),VLOOKUP(C45,'[1]Din Rep'!$C:$M,10,0)),\"\")","v":0},{"$f":"IFERROR(IFERROR(VLOOKUP(B45,'[1]Din Rep'!$B:$M,12,0),VLOOKUP(C45,'[1]Din Rep'!$C:$M,11,0)),\"\")","v":"45 DD"}]
[null,"SU037F00DIV7A",{"$f":"IFERROR(VLOOKUP(B46,'[1]Din Rep'!$B:$M,2,0),\"\")","v":"CAMISETA MANGA LONGA FEMININO EM LYCRA DIVA 7 A SURF MORMAII"},{"$f":"IFERROR(IFERROR(VLOOKUP(B46,'[1]Din Rep'!$B:$M,5,0),VLOOKUP(C46,'[1]Din Rep'!$C:$M,4,0)),\"\")","v":59.88505},{"$f":"IFERROR(IFERROR(VLOOKUP(B46,'[1]Din Rep'!$B:$M,7,0),VLOOKUP(C46,'[1]Din Rep'!$C:$M,6,0)),\"\")","v":63.707500000000003},{"$f":"IFERROR(IFERROR(VLOOKUP(B46,'[1]Din Rep'!$B:$M,8,0),VLOOKUP(C46,'[1]Din Rep'!$C:$M,7,0)),\"\")","v":149.9},{"$f":"IFERROR(IFERROR(VLOOKUP(B46,'[1]Din Rep'!$B:$M,10,0),VLOOKUP(C46,'[1]Din Rep'!$C:$M,9,0)),\"\")","v":2.3529411764705883},{"$f":"IFERROR(IFERROR(VLOOKUP(B46,'[1]Din Rep'!$B:$M,11,0),VLOOKUP(C46,'[1]Din Rep'!$C:$M,10,0)),\"\")","v":0},{"$f":"IFERROR(IFERROR(VLOOKUP(B46,'[1]Din Rep'!$B:$M,12,0),VLOOKUP(C46,'[1]Din Rep'!$C:$M,11,0)),\"\")","v":"45 DD"}]
["7 - NEXT MASC","SU001M32NXT2A",{"$f":"IFERROR(VLOOKUP(B47,'[1]Din Rep'!$B:$M,2,0),\"\")","v":"LONG JOHN MANGA LONGA CHESTZIP 3/2 MM INFANTIL NEXT 2A SURF MORMAII"},{"$f":"IFERROR(IFERROR(VLOOKUP(B47,'[1]Din Rep'!$B:$M,5,0),VLOOKUP(C47,'[1]Din Rep'!$C:$M,4,0)),\"\")","v":359.51004999999998},{"$f":"IFERROR(IFERROR(VLOOKUP(B47,'[1]Din Rep'!$B:$M,7,0),VLOOKUP(C47,'[1]Din Rep'!$C:$M,6,0)),\"\")","v":382.45749999999998},{"$f":"IFERROR(IFERROR(VLOOKUP(B47,'[1]Din Rep'!$B:$M,8,0),VLOOKUP(C47,'[1]Din Rep'!$C:$M,7,0)),\"\")","v":899.9},{"$f":"IFERROR(IFERROR(VLOOKUP(B47,'[1]Din Rep'!$B:$M,10,0),VLOOKUP(C47,'[1]Din Rep'!$C:$M,9,0)),\"\")","v":2.3529411764705883},{"$f":"IFERROR(IFERROR(VLOOKUP(B47,'[1]Din Rep'!$B:$M,11,0),VLOOKUP(C47,'[1]Din Rep'!$C:$M,10,0)),\"\")","v":0},{"$f":"IFERROR(IFERROR(VLOOKUP(B47,'[1]Din Rep'!$B:$M,12,0),VLOOKUP(C47,'[1]Din Rep'!$C:$M,11,0)),\"\")","v":"45 DD"}]
[null,"SU001M32NXT2B",{"$f":"IFERROR(VLOOKUP(B48,'[1]Din Rep'!$B:$M,2,0),\"\")","v":"LONG JOHN MANGA LONGA BACK 3/2 MM INFANTIL NEXT 2A SURF MORMAII"},{"$f":"IFERROR(IFERROR(VLOOKUP(B48,'[1]Din Rep'!$B:$M,5,0),VLOOKUP(C48,'[1]Din Rep'!$C:$M,4,0)),\"\")","v":359.51004999999998},{"$f":"IFERROR(IFERROR(VLOOKUP(B48,'[1]Din Rep'!$B:$M,7,0),VLOOKUP(C48,'[1]Din Rep'!$C:$M,6,0)),\"\")","v":382.45749999999998},{"$f":"IFERROR(IFERROR(VLOOKUP(B48,'[1]Din Rep'!$B:$M,8,0),VLOOKUP(C48,'[1]Din Rep'!$C:$M,7,0)),\"\")","v":899.9},{"$f":"IFERROR(IFERROR(VLOOKUP(B48,'[1]Din Rep'!$B:$M,10,0),VLOOKUP(C48,'[1]Din Rep'!$C:$M,9,0)),\"\")","v":2.3529411764705883},{"$f":"IFERROR(IFERROR(VLOOKUP(B48,'[1]Din Rep'!$B:$M,11,0),VLOOKUP(C48,'[1]Din Rep'!$C:$M,10,0)),\"\")","v":0},{"$f":"IFERROR(IFERROR(VLOOKUP(B48,'[1]Din Rep'!$B:$M,12,0),VLOOKUP(C48,'[1]Din Rep'!$C:$M,11,0)),\"\")","v":"45 DD"}]
[null,"SU001M10NXT2A",{"$f":"IFERROR(VLOOKUP(B49,'[1]Din Rep'!$B:$M,2,0),\"\")","v":"LONG JOHN MANGA LONGA BACK 1 MM INFANTIL NEXT 2A SURF MORMAII"},{"$f":"IFERROR(IFERROR(VLOOKUP(B49,'[1]Din Rep'!$B:$M,5,0),VLOOKUP(C49,'[1]Din Rep'!$C:$M,4,0)),\"\")","v":279.61004999999994},{"$f":"IFERROR(IFERROR(VLOOKUP(B49,'[1]Din Rep'!$B:$M,7,0),VLOOKUP(C49,'[1]Din Rep'!$C:$M,6,0)),\"\")","v":297.45749999999998},{"$f":"IFERROR(IFERROR(VLOOKUP(B49,'[1]Din Rep'!$B:$M,8,0),VLOOKUP(C49,'[1]Din Rep'!$C:$M,7,0)),\"\")","v":699.9},{"$f":"IFERROR(IFERROR(VLOOKUP(B49,'[1]Din Rep'!$B:$M,10,0),VLOOKUP(C49,'[1]Din Rep'!$C:$M,9,0)),\"\")","v":2.3529411764705883},{"$f":"IFERROR(IFERROR(VLOOKUP(B49,'[1]Din Rep'!$B:$M,11,0),VLOOKUP(C49,'[1]Din Rep'!$C:$M,10,0)),\"\")","v":0},{"$f":"IFERROR(IFERROR(VLOOKUP(B49,'[1]Din Rep'!$B:$M,12,0),VLOOKUP(C49,'[1]Din Rep'!$C:$M,11,0)),\"\")","v":"45 DD"}]
[null,"SU005M10NXT2A",{"$f":"IFERROR(VLOOKUP(B50,'[1]Din Rep'!$B:$M,2,0),\"\")","v":"SHORT JOHN MANGA LONGA CHESTZIP 1MM MASCULINO NEXT 2A SURF MORMAII"},{"$f":"IFERROR(IFERROR(VLOOKUP(B50,'[1]Din Rep'!$B:$M,5,0),VLOOKUP(C50,'[1]Din Rep'!$C:$M,4,0)),\"\")","v":199.71004999999997},{"$f":"IFERROR(IFERROR(VLOOKUP(B50,'[1]Din Rep'!$B:$M,7,0),VLOOKUP(C50,'[1]Din Rep'!$C:$M,6,0)),\"\")","v":212.45749999999998},{"$f":"IFERROR(IFERROR(VLOOKUP(B50,'[1]Din Rep'!$B:$M,8,0),VLOOKUP(C50,'[1]Din Rep'!$C:$M,7,0)),\"\")","v":499.9},{"$f":"IFERROR(IFERROR(VLOOKUP(B50,'[1]Din Rep'!$B:$M,10,0),VLOOKUP(C50,'[1]Din Rep'!$C:$M,9,0)),\"\")","v":2.3529411764705883},{"$f":"IFERROR(IFERROR(VLOOKUP(B50,'[1]Din Rep'!$B:$M,11,0),VLOOKUP(C50,'[1]Din Rep'!$C:$M,10,0)),\"\")","v":0},{"$f":"IFERROR(IFERROR(VLOOKUP(B50,'[1]Din Rep'!$B:$M,12,0),VLOOKUP(C50,'[1]Din Rep'!$C:$M,11,0)),\"\")","v":"45 DD"}]
[null,"SU054M10NXT2A",{"$f":"IFERROR(VLOOKUP(B51,'[1]Din Rep'!$B:$M,2,0),\"\")","v":"BERMUDA 1.0MM INFANTIL NEXT 2A SURF MORMAII "},{"$f":"IFERROR(IFERROR(VLOOKUP(B51,'[1]Din Rep'!$B:$M,5,0),VLOOKUP(C51,'[1]Din Rep'!$C:$M,4,0)),\"\")","v":59.88505},{"$f":"IFERROR(IFERROR(VLOOKUP(B51,'[1]Din Rep'!$B:$M,7,0),VLOOKUP(C51,'[1]Din Rep'!$C:$M,6,0)),\"\")","v":63.707500000000003},{"$f":"IFERROR(IFERROR(VLOOKUP(B51,'[1]Din Rep'!$B:$M,8,0),VLOOKUP(C51,'[1]Din Rep'!$C:$M,7,0)),\"\")","v":149.9},{"$f":"IFERROR(IFERROR(VLOOKUP(B51,'[1]Din Rep'!$B:$M,10,0),VLOOKUP(C51,'[1]Din Rep'!$C:$M,9,0)),\"\")","v":2.3529411764705883},{"$f":"IFERROR(IFERROR(VLOOKUP(B51,'[1]Din Rep'!$B:$M,11,0),VLOOKUP(C51,'[1]Din Rep'!$C:$M,10,0)),\"\")","v":0},{"$f":"IFERROR(IFERROR(VLOOKUP(B51,'[1]Din Rep'!$B:$M,12,0),VLOOKUP(C51,'[1]Din Rep'!$C:$M,11,0)),\"\")","v":"45 DD"}]
[null,"SU037M00NXT2A",{"$f":"IFERROR(VLOOKUP(B52,'[1]Din Rep'!$B:$M,2,0),\"\")","v":"CAMISETA MANGA LONGA LYCRA INFANTIL NEXT 2A SURF MORMAII"},{"$f":"IFERROR(IFERROR(VLOOKUP(B52,'[1]Din Rep'!$B:$M,5,0),VLOOKUP(C52,'[1]Din Rep'!$C:$M,4,0)),\"\")","v":59.88505},{"$f":"IFERROR(IFERROR(VLOOKUP(B52,'[1]Din Rep'!$B:$M,7,0),VLOOKUP(C52,'[1]Din Rep'!$C:$M,6,0)),\"\")","v":63.707500000000003},{"$f":"IFERROR(IFERROR(VLOOKUP(B52,'[1]Din Rep'!$B:$M,8,0),VLOOKUP(C52,'[1]Din Rep'!$C:$M,7,0)),\"\")","v":149.9},{"$f":"IFERROR(IFERROR(VLOOKUP(B52,'[1]Din Rep'!$B:$M,10,0),VLOOKUP(C52,'[1]Din Rep'!$C:$M,9,0)),\"\")","v":2.3529411764705883},{"$f":"IFERROR(IFERROR(VLOOKUP(B52,'[1]Din Rep'!$B:$M,11,0),VLOOKUP(C52,'[1]Din Rep'!$C:$M,10,0)),\"\")","v":0},{"$f":"IFERROR(IFERROR(VLOOKUP(B52,'[1]Din Rep'!$B:$M,12,0),VLOOKUP(C52,'[1]Din Rep'!$C:$M,11,0)),\"\")","v":"45 DD"}]
[null,"SU040M10NXT2A",{"$f":"IFERROR(VLOOKUP(B53,'[1]Din Rep'!$B:$M,2,0),\"\")","v":"CAMISETA DE LYCRA MANGA LONGA COM NEOPRENE 1,0MM INFANTIL NEXT (NOELYCRA)"},{"$f":"IFERROR(IFERROR(VLOOKUP(B53,'[1]Din Rep'!$B:$M,5,0),VLOOKUP(C53,'[1]Din Rep'!$C:$M,4,0)),\"\")","v":87.850049999999996},{"$f":"IFERROR(IFERROR(VLOOKUP(B53,'[1]Din Rep'!$B:$M,7,0),VLOOKUP(C53,'[1]Din Rep'!$C:$M,6,0)),\"\")","v":93.457499999999996},{"$f":"IFERROR(IFERROR(VLOOKUP(B53,'[1]Din Rep'!$B:$M,8,0),VLOOKUP(C53,'[1]Din Rep'!$C:$M,7,0)),\"\")","v":219.9},{"$f":"IFERROR(IFERROR(VLOOKUP(B53,'[1]Din Rep'!$B:$M,10,0),VLOOKUP(C53,'[1]Din Rep'!$C:$M,9,0)),\"\")","v":2.3529411764705883},{"$f":"IFERROR(IFERROR(VLOOKUP(B53,'[1]Din Rep'!$B:$M,11,0),VLOOKUP(C53,'[1]Din Rep'!$C:$M,10,0)),\"\")","v":0},{"$f":"IFERROR(IFERROR(VLOOKUP(B53,'[1]Din Rep'!$B:$M,12,0),VLOOKUP(C53,'[1]Din Rep'!$C:$M,11,0)),\"\")","v":"45 DD"}]
["7 - NEXT FEM","SU001F32NXT2A",{"$f":"IFERROR(VLOOKUP(B54,'[1]Din Rep'!$B:$M,2,0),\"\")","v":"LONG JOHN MANGA LONGA BACKZIP 3/2MM FEMININO NEXT 2A SURF MORMAII"},{"$f":"IFERROR(IFERROR(VLOOKUP(B54,'[1]Din Rep'!$B:$M,5,0),VLOOKUP(C54,'[1]Din Rep'!$C:$M,4,0)),\"\")","v":359.51004999999998},{"$f":"IFERROR(IFERROR(VLOOKUP(B54,'[1]Din Rep'!$B:$M,7,0),VLOOKUP(C54,'[1]Din Rep'!$C:$M,6,0)),\"\")","v":382.45749999999998},{"$f":"IFERROR(IFERROR(VLOOKUP(B54,'[1]Din Rep'!$B:$M,8,0),VLOOKUP(C54,'[1]Din Rep'!$C:$M,7,0)),\"\")","v":899.9},{"$f":"IFERROR(IFERROR(VLOOKUP(B54,'[1]Din Rep'!$B:$M,10,0),VLOOKUP(C54,'[1]Din Rep'!$C:$M,9,0)),\"\")","v":2.3529411764705883},{"$f":"IFERROR(IFERROR(VLOOKUP(B54,'[1]Din Rep'!$B:$M,11,0),VLOOKUP(C54,'[1]Din Rep'!$C:$M,10,0)),\"\")","v":0},{"$f":"IFERROR(IFERROR(VLOOKUP(B54,'[1]Din Rep'!$B:$M,12,0),VLOOKUP(C54,'[1]Din Rep'!$C:$M,11,0)),\"\")","v":"45 DD"}]
[null,"SU001F32NXT2B",{"$f":"IFERROR(VLOOKUP(B55,'[1]Din Rep'!$B:$M,2,0),\"\")","v":"LONG JOHN MANGA LONGA CHESTZIP 3/2MM FEMININO NEXT 2B SURF MORMAII"},{"$f":"IFERROR(IFERROR(VLOOKUP(B55,'[1]Din Rep'!$B:$M,5,0),VLOOKUP(C55,'[1]Din Rep'!$C:$M,4,0)),\"\")","v":359.51004999999998},{"$f":"IFERROR(IFERROR(VLOOKUP(B55,'[1]Din Rep'!$B:$M,7,0),VLOOKUP(C55,'[1]Din Rep'!$C:$M,6,0)),\"\")","v":382.45749999999998},{"$f":"IFERROR(IFERROR(VLOOKUP(B55,'[1]Din Rep'!$B:$M,8,0),VLOOKUP(C55,'[1]Din Rep'!$C:$M,7,0)),\"\")","v":899.9},{"$f":"IFERROR(IFERROR(VLOOKUP(B55,'[1]Din Rep'!$B:$M,10,0),VLOOKUP(C55,'[1]Din Rep'!$C:$M,9,0)),\"\")","v":2.3529411764705883},{"$f":"IFERROR(IFERROR(VLOOKUP(B55,'[1]Din Rep'!$B:$M,11,0),VLOOKUP(C55,'[1]Din Rep'!$C:$M,10,0)),\"\")","v":0},{"$f":"IFERROR(IFERROR(VLOOKUP(B55,'[1]Din Rep'!$B:$M,12,0),VLOOKUP(C55,'[1]Din Rep'!$C:$M,11,0)),\"\")","v":"45 DD"}]
[null,"SU001F10NXT2A",{"$f":"IFERROR(VLOOKUP(B56,'[1]Din Rep'!$B:$M,2,0),\"\")","v":"LONG JOHN MANGA LONGA CHESTZIP 1MM FEMININO NEXT 2A SURF MORMAII"},{"$f":"IFERROR(IFERROR(VLOOKUP(B56,'[1]Din Rep'!$B:$M,5,0),VLOOKUP(C56,'[1]Din Rep'!$C:$M,4,0)),\"\")","v":279.61004999999994},{"$f":"IFERROR(IFERROR(VLOOKUP(B56,'[1]Din Rep'!$B:$M,7,0),VLOOKUP(C56,'[1]Din Rep'!$C:$M,6,0)),\"\")","v":297.45749999999998},{"$f":"IFERROR(IFERROR(VLOOKUP(B56,'[1]Din Rep'!$B:$M,8,0),VLOOKUP(C56,'[1]Din Rep'!$C:$M,7,0)),\"\")","v":699.9},{"$f":"IFERROR(IFERROR(VLOOKUP(B56,'[1]Din Rep'!$B:$M,10,0),VLOOKUP(C56,'[1]Din Rep'!$C:$M,9,0)),\"\")","v":2.3529411764705883},{"$f":"IFERROR(IFERROR(VLOOKUP(B56,'[1]Din Rep'!$B:$M,11,0),VLOOKUP(C56,'[1]Din Rep'!$C:$M,10,0)),\"\")","v":0},{"$f":"IFERROR(IFERROR(VLOOKUP(B56,'[1]Din Rep'!$B:$M,12,0),VLOOKUP(C56,'[1]Din Rep'!$C:$M,11,0)),\"\")","v":"45 DD"}]
[null,"SU005F10NXT2A",{"$f":"IFERROR(VLOOKUP(B57,'[1]Din Rep'!$B:$M,2,0),\"\")","v":"SHORT JOHN MANGA LONGA CHESTZIP 1MM FEMININO NEXT 2A SURF MORMAII"},{"$f":"IFERROR(IFERROR(VLOOKUP(B57,'[1]Din Rep'!$B:$M,5,0),VLOOKUP(C57,'[1]Din Rep'!$C:$M,4,0)),\"\")","v":191.72004999999996},{"$f":"IFERROR(IFERROR(VLOOKUP(B57,'[1]Din Rep'!$B:$M,7,0),VLOOKUP(C57,'[1]Din Rep'!$C:$M,6,0)),\"\")","v":203.95749999999998},{"$f":"IFERROR(IFERROR(VLOOKUP(B57,'[1]Din Rep'!$B:$M,8,0),VLOOKUP(C57,'[1]Din Rep'!$C:$M,7,0)),\"\")","v":479.9},{"$f":"IFERROR(IFERROR(VLOOKUP(B57,'[1]Din Rep'!$B:$M,10,0),VLOOKUP(C57,'[1]Din Rep'!$C:$M,9,0)),\"\")","v":2.3529411764705883},{"$f":"IFERROR(IFERROR(VLOOKUP(B57,'[1]Din Rep'!$B:$M,11,0),VLOOKUP(C57,'[1]Din Rep'!$C:$M,10,0)),\"\")","v":0},{"$f":"IFERROR(IFERROR(VLOOKUP(B57,'[1]Din Rep'!$B:$M,12,0),VLOOKUP(C57,'[1]Din Rep'!$C:$M,11,0)),\"\")","v":"45 DD"}]
[null,"SU040F10NXT2A",{"$f":"IFERROR(VLOOKUP(B58,'[1]Din Rep'!$B:$M,2,0),\"\")","v":"CAMISETA DE LYCRA MANGA LONGA C/ NEOPRENE 1MM FEMININO NEXT 2A SURF MORMAII (NOELYCRA)"},{"$f":"IFERROR(IFERROR(VLOOKUP(B58,'[1]Din Rep'!$B:$M,5,0),VLOOKUP(C58,'[1]Din Rep'!$C:$M,4,0)),\"\")","v":87.850049999999996},{"$f":"IFERROR(IFERROR(VLOOKUP(B58,'[1]Din Rep'!$B:$M,7,0),VLOOKUP(C58,'[1]Din Rep'!$C:$M,6,0)),\"\")","v":93.457499999999996},{"$f":"IFERROR(IFERROR(VLOOKUP(B58,'[1]Din Rep'!$B:$M,8,0),VLOOKUP(C58,'[1]Din Rep'!$C:$M,7,0)),\"\")","v":219.9},{"$f":"IFERROR(IFERROR(VLOOKUP(B58,'[1]Din Rep'!$B:$M,10,0),VLOOKUP(C58,'[1]Din Rep'!$C:$M,9,0)),\"\")","v":2.3529411764705883},{"$f":"IFERROR(IFERROR(VLOOKUP(B58,'[1]Din Rep'!$B:$M,11,0),VLOOKUP(C58,'[1]Din Rep'!$C:$M,10,0)),\"\")","v":0},{"$f":"IFERROR(IFERROR(VLOOKUP(B58,'[1]Din Rep'!$B:$M,12,0),VLOOKUP(C58,'[1]Din Rep'!$C:$M,11,0)),\"\")","v":"45 DD"}]
[null,"SU037F00NXT2A",{"$f":"IFERROR(VLOOKUP(B59,'[1]Din Rep'!$B:$M,2,0),\"\")","v":"CAMISETA MANGA LONGA LYCRA FEMININO NEXT 2A SURF MORMAII"},{"$f":"IFERROR(IFERROR(VLOOKUP(B59,'[1]Din Rep'!$B:$M,5,0),VLOOKUP(C59,'[1]Din Rep'!$C:$M,4,0)),\"\")","v":59.88505},{"$f":"IFERROR(IFERROR(VLOOKUP(B59,'[1]Din Rep'!$B:$M,7,0),VLOOKUP(C59,'[1]Din Rep'!$C:$M,6,0)),\"\")","v":63.707500000000003},{"$f":"IFERROR(IFERROR(VLOOKUP(B59,'[1]Din Rep'!$B:$M,8,0),VLOOKUP(C59,'[1]Din Rep'!$C:$M,7,0)),\"\")","v":149.9},{"$f":"IFERROR(IFERROR(VLOOKUP(B59,'[1]Din Rep'!$B:$M,10,0),VLOOKUP(C59,'[1]Din Rep'!$C:$M,9,0)),\"\")","v":2.3529411764705883},{"$f":"IFERROR(IFERROR(VLOOKUP(B59,'[1]Din Rep'!$B:$M,11,0),VLOOKUP(C59,'[1]Din Rep'!$C:$M,10,0)),\"\")","v":0},{"$f":"IFERROR(IFERROR(VLOOKUP(B59,'[1]Din Rep'!$B:$M,12,0),VLOOKUP(C59,'[1]Din Rep'!$C:$M,11,0)),\"\")","v":"45 DD"}]
[null,"SU054F10NXT2A",{"$f":"IFERROR(VLOOKUP(B60,'[1]Din Rep'!$B:$M,2,0),\"\")","v":"BERMUDA 1MM FEMININO NEXT 2A SURF MORMAII"},{"$f":"IFERROR(IFERROR(VLOOKUP(B60,'[1]Din Rep'!$B:$M,5,0),VLOOKUP(C60,'[1]Din Rep'!$C:$M,4,0)),\"\")","v":59.88505},{"$f":"IFERROR(IFERROR(VLOOKUP(B60,'[1]Din Rep'!$B:$M,7,0),VLOOKUP(C60,'[1]Din Rep'!$C:$M,6,0)),\"\")","v":63.707500000000003},{"$f":"IFERROR(IFERROR(VLOOKUP(B60,'[1]Din Rep'!$B:$M,8,0),VLOOKUP(C60,'[1]Din Rep'!$C:$M,7,0)),\"\")","v":149.9},{"$f":"IFERROR(IFERROR(VLOOKUP(B60,'[1]Din Rep'!$B:$M,10,0),VLOOKUP(C60,'[1]Din Rep'!$C:$M,9,0)),\"\")","v":2.3529411764705883},{"$f":"IFERROR(IFERROR(VLOOKUP(B60,'[1]Din Rep'!$B:$M,11,0),VLOOKUP(C60,'[1]Din Rep'!$C:$M,10,0)),\"\")","v":0},{"$f":"IFERROR(IFERROR(VLOOKUP(B60,'[1]Din Rep'!$B:$M,12,0),VLOOKUP(C60,'[1]Din Rep'!$C:$M,11,0)),\"\")","v":"45 DD"}]
["8 - VENTUS","SU005M10VNT1A",{"$f":"IFERROR(VLOOKUP(B61,'[1]Din Rep'!$B:$M,2,0),\"\")","v":"SHORT JOHN MANGA LONGA EM LYCRA 1,0MM VENTUS"},{"$f":"IFERROR(IFERROR(VLOOKUP(B61,'[1]Din Rep'!$B:$M,5,0),VLOOKUP(C61,'[1]Din Rep'!$C:$M,4,0)),\"\")","v":203.70504999999997},{"$f":"IFERROR(IFERROR(VLOOKUP(B61,'[1]Din Rep'!$B:$M,7,0),VLOOKUP(C61,'[1]Din Rep'!$C:$M,6,0)),\"\")","v":216.70749999999998},{"$f":"IFERROR(IFERROR(VLOOKUP(B61,'[1]Din Rep'!$B:$M,8,0),VLOOKUP(C61,'[1]Din Rep'!$C:$M,7,0)),\"\")","v":509.9},{"$f":"IFERROR(IFERROR(VLOOKUP(B61,'[1]Din Rep'!$B:$M,10,0),VLOOKUP(C61,'[1]Din Rep'!$C:$M,9,0)),\"\")","v":2.3529411764705883},{"$f":"IFERROR(IFERROR(VLOOKUP(B61,'[1]Din Rep'!$B:$M,11,0),VLOOKUP(C61,'[1]Din Rep'!$C:$M,10,0)),\"\")","v":0},{"$f":"IFERROR(IFERROR(VLOOKUP(B61,'[1]Din Rep'!$B:$M,12,0),VLOOKUP(C61,'[1]Din Rep'!$C:$M,11,0)),\"\")","v":"45 DD"}]
[null,"SU035M10VNT1A",{"$f":"IFERROR(VLOOKUP(B62,'[1]Din Rep'!$B:$M,2,0),\"\")","v":"JAQUETA SEM MANGA NEOPRENE 1,0MM COM LATERAIS EM LYCRA "},{"$f":"IFERROR(IFERROR(VLOOKUP(B62,'[1]Din Rep'!$B:$M,5,0),VLOOKUP(C62,'[1]Din Rep'!$C:$M,4,0)),\"\")","v":79.860049999999987},{"$f":"IFERROR(IFERROR(VLOOKUP(B62,'[1]Din Rep'!$B:$M,7,0),VLOOKUP(C62,'[1]Din Rep'!$C:$M,6,0)),\"\")","v":84.957499999999996},{"$f":"IFERROR(IFERROR(VLOOKUP(B62,'[1]Din Rep'!$B:$M,8,0),VLOOKUP(C62,'[1]Din Rep'!$C:$M,7,0)),\"\")","v":199.9},{"$f":"IFERROR(IFERROR(VLOOKUP(B62,'[1]Din Rep'!$B:$M,10,0),VLOOKUP(C62,'[1]Din Rep'!$C:$M,9,0)),\"\")","v":2.3529411764705883},{"$f":"IFERROR(IFERROR(VLOOKUP(B62,'[1]Din Rep'!$B:$M,11,0),VLOOKUP(C62,'[1]Din Rep'!$C:$M,10,0)),\"\")","v":0},{"$f":"IFERROR(IFERROR(VLOOKUP(B62,'[1]Din Rep'!$B:$M,12,0),VLOOKUP(C62,'[1]Din Rep'!$C:$M,11,0)),\"\")","v":"45 DD"}]
[null,"SU053M10VNT1A",{"$f":"IFERROR(VLOOKUP(B63,'[1]Din Rep'!$B:$M,2,0),\"\")","v":"CALÇA DE LYCRA COM REFORÇO EM NEOPRENE 1,0MM (JOELHOS E NADEGAS)"},{"$f":"IFERROR(IFERROR(VLOOKUP(B63,'[1]Din Rep'!$B:$M,5,0),VLOOKUP(C63,'[1]Din Rep'!$C:$M,4,0)),\"\")","v":71.870049999999992},{"$f":"IFERROR(IFERROR(VLOOKUP(B63,'[1]Din Rep'!$B:$M,7,0),VLOOKUP(C63,'[1]Din Rep'!$C:$M,6,0)),\"\")","v":76.457499999999996},{"$f":"IFERROR(IFERROR(VLOOKUP(B63,'[1]Din Rep'!$B:$M,8,0),VLOOKUP(C63,'[1]Din Rep'!$C:$M,7,0)),\"\")","v":179.9},{"$f":"IFERROR(IFERROR(VLOOKUP(B63,'[1]Din Rep'!$B:$M,10,0),VLOOKUP(C63,'[1]Din Rep'!$C:$M,9,0)),\"\")","v":2.3529411764705883},{"$f":"IFERROR(IFERROR(VLOOKUP(B63,'[1]Din Rep'!$B:$M,11,0),VLOOKUP(C63,'[1]Din Rep'!$C:$M,10,0)),\"\")","v":0},{"$f":"IFERROR(IFERROR(VLOOKUP(B63,'[1]Din Rep'!$B:$M,12,0),VLOOKUP(C63,'[1]Din Rep'!$C:$M,11,0)),\"\")","v":"45 DD"}]
["10 - ACESSÓRIOS SURF","SU079M00INT3A",{"$f":"IFERROR(VLOOKUP(B64,'[1]Din Rep'!$B:$M,2,0),\"\")","v":"SURF PONCHO MASCULINO INTERMEDIÁRIO 3A SURF MORMAII"},{"$f":"IFERROR(IFERROR(VLOOKUP(B64,'[1]Din Rep'!$B:$M,5,0),VLOOKUP(C64,'[1]Din Rep'!$C:$M,4,0)),\"\")","v":79.860049999999987},{"$f":"IFERROR(IFERROR(VLOOKUP(B64,'[1]Din Rep'!$B:$M,7,0),VLOOKUP(C64,'[1]Din Rep'!$C:$M,6,0)),\"\")","v":84.957499999999996},{"$f":"IFERROR(IFERROR(VLOOKUP(B64,'[1]Din Rep'!$B:$M,8,0),VLOOKUP(C64,'[1]Din Rep'!$C:$M,7,0)),\"\")","v":199.9},{"$f":"IFERROR(IFERROR(VLOOKUP(B64,'[1]Din Rep'!$B:$M,10,0),VLOOKUP(C64,'[1]Din Rep'!$C:$M,9,0)),\"\")","v":2.3529411764705883},{"$f":"IFERROR(IFERROR(VLOOKUP(B64,'[1]Din Rep'!$B:$M,11,0),VLOOKUP(C64,'[1]Din Rep'!$C:$M,10,0)),\"\")","v":0},{"$f":"IFERROR(IFERROR(VLOOKUP(B64,'[1]Din Rep'!$B:$M,12,0),VLOOKUP(C64,'[1]Din Rep'!$C:$M,11,0)),\"\")","v":"45 DD"}]
[null,"SU079F00INT3A",{"$f":"IFERROR(VLOOKUP(B65,'[1]Din Rep'!$B:$M,2,0),\"\")","v":"SURF PONCHO FEMININO INTERMEDIÁRIO 3A SURF MORMAII"},{"$f":"IFERROR(IFERROR(VLOOKUP(B65,'[1]Din Rep'!$B:$M,5,0),VLOOKUP(C65,'[1]Din Rep'!$C:$M,4,0)),\"\")","v":79.860049999999987},{"$f":"IFERROR(IFERROR(VLOOKUP(B65,'[1]Din Rep'!$B:$M,7,0),VLOOKUP(C65,'[1]Din Rep'!$C:$M,6,0)),\"\")","v":84.957499999999996},{"$f":"IFERROR(IFERROR(VLOOKUP(B65,'[1]Din Rep'!$B:$M,8,0),VLOOKUP(C65,'[1]Din Rep'!$C:$M,7,0)),\"\")","v":199.9},{"$f":"IFERROR(IFERROR(VLOOKUP(B65,'[1]Din Rep'!$B:$M,10,0),VLOOKUP(C65,'[1]Din Rep'!$C:$M,9,0)),\"\")","v":2.3529411764705883},{"$f":"IFERROR(IFERROR(VLOOKUP(B65,'[1]Din Rep'!$B:$M,11,0),VLOOKUP(C65,'[1]Din Rep'!$C:$M,10,0)),\"\")","v":0},{"$f":"IFERROR(IFERROR(VLOOKUP(B65,'[1]Din Rep'!$B:$M,12,0),VLOOKUP(C65,'[1]Din Rep'!$C:$M,11,0)),\"\")","v":"45 DD"}]
[null,"SU062U30BAS1A",{"$f":"IFERROR(VLOOKUP(B66,'[1]Din Rep'!$B:$M,2,0),\"\")","v":"BOTA MULTISPORTS CANO LONGO BASICA"},{"$f":"IFERROR(IFERROR(VLOOKUP(B66,'[1]Din Rep'!$B:$M,5,0),VLOOKUP(C66,'[1]Din Rep'!$C:$M,4,0)),\"\")","v":37.562400000000004},{"$f":"IFERROR(IFERROR(VLOOKUP(B66,'[1]Din Rep'!$B:$M,7,0),VLOOKUP(C66,'[1]Din Rep'!$C:$M,6,0)),\"\")","v":39.960000000000008},{"$f":"IFERROR(IFERROR(VLOOKUP(B66,'[1]Din Rep'!$B:$M,8,0),VLOOKUP(C66,'[1]Din Rep'!$C:$M,7,0)),\"\")","v":99.9},{"$f":"IFERROR(IFERROR(VLOOKUP(B66,'[1]Din Rep'!$B:$M,10,0),VLOOKUP(C66,'[1]Din Rep'!$C:$M,9,0)),\"\")","v":2.4999999999999996},{"$f":"IFERROR(IFERROR(VLOOKUP(B66,'[1]Din Rep'!$B:$M,11,0),VLOOKUP(C66,'[1]Din Rep'!$C:$M,10,0)),\"\")","v":0},{"$f":"IFERROR(IFERROR(VLOOKUP(B66,'[1]Din Rep'!$B:$M,12,0),VLOOKUP(C66,'[1]Din Rep'!$C:$M,11,0)),\"\")","v":"45 DD"}]
[null,"SU061U00INT1A",{"$f":"IFERROR(VLOOKUP(B67,'[1]Din Rep'!$B:$M,2,0),\"\")","v":"BOTA SURF CANO LONGO INTERMEDIARIA"},{"$f":"IFERROR(IFERROR(VLOOKUP(B67,'[1]Din Rep'!$B:$M,5,0),VLOOKUP(C67,'[1]Din Rep'!$C:$M,4,0)),\"\")","v":119.81004999999998},{"$f":"IFERROR(IFERROR(VLOOKUP(B67,'[1]Din Rep'!$B:$M,7,0),VLOOKUP(C67,'[1]Din Rep'!$C:$M,6,0)),\"\")","v":127.45749999999998},{"$f":"IFERROR(IFERROR(VLOOKUP(B67,'[1]Din Rep'!$B:$M,8,0),VLOOKUP(C67,'[1]Din Rep'!$C:$M,7,0)),\"\")","v":299.89999999999998},{"$f":"IFERROR(IFERROR(VLOOKUP(B67,'[1]Din Rep'!$B:$M,10,0),VLOOKUP(C67,'[1]Din Rep'!$C:$M,9,0)),\"\")","v":2.3529411764705883},{"$f":"IFERROR(IFERROR(VLOOKUP(B67,'[1]Din Rep'!$B:$M,11,0),VLOOKUP(C67,'[1]Din Rep'!$C:$M,10,0)),\"\")","v":0},{"$f":"IFERROR(IFERROR(VLOOKUP(B67,'[1]Din Rep'!$B:$M,12,0),VLOOKUP(C67,'[1]Din Rep'!$C:$M,11,0)),\"\")","v":"45 DD"}]
[null,"SU061U00TOP1A",{"$f":"IFERROR(VLOOKUP(B68,'[1]Din Rep'!$B:$M,2,0),\"\")","v":"BOTA SURF CANO LONGO TOP"},{"$f":"IFERROR(IFERROR(VLOOKUP(B68,'[1]Din Rep'!$B:$M,5,0),VLOOKUP(C68,'[1]Din Rep'!$C:$M,4,0)),\"\")","v":167.75004999999999},{"$f":"IFERROR(IFERROR(VLOOKUP(B68,'[1]Din Rep'!$B:$M,7,0),VLOOKUP(C68,'[1]Din Rep'!$C:$M,6,0)),\"\")","v":178.45749999999998},{"$f":"IFERROR(IFERROR(VLOOKUP(B68,'[1]Din Rep'!$B:$M,8,0),VLOOKUP(C68,'[1]Din Rep'!$C:$M,7,0)),\"\")","v":419.9},{"$f":"IFERROR(IFERROR(VLOOKUP(B68,'[1]Din Rep'!$B:$M,10,0),VLOOKUP(C68,'[1]Din Rep'!$C:$M,9,0)),\"\")","v":2.3529411764705883},{"$f":"IFERROR(IFERROR(VLOOKUP(B68,'[1]Din Rep'!$B:$M,11,0),VLOOKUP(C68,'[1]Din Rep'!$C:$M,10,0)),\"\")","v":0},{"$f":"IFERROR(IFERROR(VLOOKUP(B68,'[1]Din Rep'!$B:$M,12,0),VLOOKUP(C68,'[1]Din Rep'!$C:$M,11,0)),\"\")","v":"45 DD"}]
[null,"SU063U00INT1B",{"$f":"IFERROR(VLOOKUP(B69,'[1]Din Rep'!$B:$M,2,0),\"\")","v":"BOTA SURF CANO CURTO INTERMEDIARIA"},{"$f":"IFERROR(IFERROR(VLOOKUP(B69,'[1]Din Rep'!$B:$M,5,0),VLOOKUP(C69,'[1]Din Rep'!$C:$M,4,0)),\"\")","v":115.81504999999997},{"$f":"IFERROR(IFERROR(VLOOKUP(B69,'[1]Din Rep'!$B:$M,7,0),VLOOKUP(C69,'[1]Din Rep'!$C:$M,6,0)),\"\")","v":123.20749999999998},{"$f":"IFERROR(IFERROR(VLOOKUP(B69,'[1]Din Rep'!$B:$M,8,0),VLOOKUP(C69,'[1]Din Rep'!$C:$M,7,0)),\"\")","v":289.89999999999998},{"$f":"IFERROR(IFERROR(VLOOKUP(B69,'[1]Din Rep'!$B:$M,10,0),VLOOKUP(C69,'[1]Din Rep'!$C:$M,9,0)),\"\")","v":2.3529411764705883},{"$f":"IFERROR(IFERROR(VLOOKUP(B69,'[1]Din Rep'!$B:$M,11,0),VLOOKUP(C69,'[1]Din Rep'!$C:$M,10,0)),\"\")","v":0},{"$f":"IFERROR(IFERROR(VLOOKUP(B69,'[1]Din Rep'!$B:$M,12,0),VLOOKUP(C69,'[1]Din Rep'!$C:$M,11,0)),\"\")","v":"45 DD"}]
[null,"SU066U00BAS1A",{"$f":"IFERROR(VLOOKUP(B70,'[1]Din Rep'!$B:$M,2,0),\"\")","v":"LUVA NEOPRENE BASICA"},{"$f":"IFERROR(IFERROR(VLOOKUP(B70,'[1]Din Rep'!$B:$M,5,0),VLOOKUP(C70,'[1]Din Rep'!$C:$M,4,0)),\"\")","v":63.88004999999999},{"$f":"IFERROR(IFERROR(VLOOKUP(B70,'[1]Din Rep'!$B:$M,7,0),VLOOKUP(C70,'[1]Din Rep'!$C:$M,6,0)),\"\")","v":67.957499999999996},{"$f":"IFERROR(IFERROR(VLOOKUP(B70,'[1]Din Rep'!$B:$M,8,0),VLOOKUP(C70,'[1]Din Rep'!$C:$M,7,0)),\"\")","v":159.9},{"$f":"IFERROR(IFERROR(VLOOKUP(B70,'[1]Din Rep'!$B:$M,10,0),VLOOKUP(C70,'[1]Din Rep'!$C:$M,9,0)),\"\")","v":2.3529411764705883},{"$f":"IFERROR(IFERROR(VLOOKUP(B70,'[1]Din Rep'!$B:$M,11,0),VLOOKUP(C70,'[1]Din Rep'!$C:$M,10,0)),\"\")","v":0},{"$f":"IFERROR(IFERROR(VLOOKUP(B70,'[1]Din Rep'!$B:$M,12,0),VLOOKUP(C70,'[1]Din Rep'!$C:$M,11,0)),\"\")","v":"45 DD"}]
[null,"SU066U00INT1A",{"$f":"IFERROR(VLOOKUP(B71,'[1]Din Rep'!$B:$M,2,0),\"\")","v":"LUVA NEOPRENE INTERMEDIARIA"},{"$f":"IFERROR(IFERROR(VLOOKUP(B71,'[1]Din Rep'!$B:$M,5,0),VLOOKUP(C71,'[1]Din Rep'!$C:$M,4,0)),\"\")","v":139.78504999999998},{"$f":"IFERROR(IFERROR(VLOOKUP(B71,'[1]Din Rep'!$B:$M,7,0),VLOOKUP(C71,'[1]Din Rep'!$C:$M,6,0)),\"\")","v":148.70749999999998},{"$f":"IFERROR(IFERROR(VLOOKUP(B71,'[1]Din Rep'!$B:$M,8,0),VLOOKUP(C71,'[1]Din Rep'!$C:$M,7,0)),\"\")","v":349.9},{"$f":"IFERROR(IFERROR(VLOOKUP(B71,'[1]Din Rep'!$B:$M,10,0),VLOOKUP(C71,'[1]Din Rep'!$C:$M,9,0)),\"\")","v":2.3529411764705883},{"$f":"IFERROR(IFERROR(VLOOKUP(B71,'[1]Din Rep'!$B:$M,11,0),VLOOKUP(C71,'[1]Din Rep'!$C:$M,10,0)),\"\")","v":0},{"$f":"IFERROR(IFERROR(VLOOKUP(B71,'[1]Din Rep'!$B:$M,12,0),VLOOKUP(C71,'[1]Din Rep'!$C:$M,11,0)),\"\")","v":"45 DD"}]
[null,"SU066U00TOP1A",{"$f":"IFERROR(VLOOKUP(B72,'[1]Din Rep'!$B:$M,2,0),\"\")","v":"LUVA NEOPRENE TOP"},{"$f":"IFERROR(IFERROR(VLOOKUP(B72,'[1]Din Rep'!$B:$M,5,0),VLOOKUP(C72,'[1]Din Rep'!$C:$M,4,0)),\"\")","v":143.78004999999999},{"$f":"IFERROR(IFERROR(VLOOKUP(B72,'[1]Din Rep'!$B:$M,7,0),VLOOKUP(C72,'[1]Din Rep'!$C:$M,6,0)),\"\")","v":152.95749999999998},{"$f":"IFERROR(IFERROR(VLOOKUP(B72,'[1]Din Rep'!$B:$M,8,0),VLOOKUP(C72,'[1]Din Rep'!$C:$M,7,0)),\"\")","v":359.9},{"$f":"IFERROR(IFERROR(VLOOKUP(B72,'[1]Din Rep'!$B:$M,10,0),VLOOKUP(C72,'[1]Din Rep'!$C:$M,9,0)),\"\")","v":2.3529411764705883},{"$f":"IFERROR(IFERROR(VLOOKUP(B72,'[1]Din Rep'!$B:$M,11,0),VLOOKUP(C72,'[1]Din Rep'!$C:$M,10,0)),\"\")","v":0},{"$f":"IFERROR(IFERROR(VLOOKUP(B72,'[1]Din Rep'!$B:$M,12,0),VLOOKUP(C72,'[1]Din Rep'!$C:$M,11,0)),\"\")","v":"45 DD"}]
[null,"SU058U00INT1A",{"$f":"IFERROR(VLOOKUP(B73,'[1]Din Rep'!$B:$M,2,0),\"\")","v":"GORRO NEOPRENE INTERMEDIARIO"},{"$f":"IFERROR(IFERROR(VLOOKUP(B73,'[1]Din Rep'!$B:$M,5,0),VLOOKUP(C73,'[1]Din Rep'!$C:$M,4,0)),\"\")","v":87.850049999999996},{"$f":"IFERROR(IFERROR(VLOOKUP(B73,'[1]Din Rep'!$B:$M,7,0),VLOOKUP(C73,'[1]Din Rep'!$C:$M,6,0)),\"\")","v":93.457499999999996},{"$f":"IFERROR(IFERROR(VLOOKUP(B73,'[1]Din Rep'!$B:$M,8,0),VLOOKUP(C73,'[1]Din Rep'!$C:$M,7,0)),\"\")","v":219.9},{"$f":"IFERROR(IFERROR(VLOOKUP(B73,'[1]Din Rep'!$B:$M,10,0),VLOOKUP(C73,'[1]Din Rep'!$C:$M,9,0)),\"\")","v":2.3529411764705883},{"$f":"IFERROR(IFERROR(VLOOKUP(B73,'[1]Din Rep'!$B:$M,11,0),VLOOKUP(C73,'[1]Din Rep'!$C:$M,10,0)),\"\")","v":0},{"$f":"IFERROR(IFERROR(VLOOKUP(B73,'[1]Din Rep'!$B:$M,12,0),VLOOKUP(C73,'[1]Din Rep'!$C:$M,11,0)),\"\")","v":"45 DD"}]
["11 - BABY","SU017B00GRO5A",{"$f":"IFERROR(VLOOKUP(B74,'[1]Din Rep'!$B:$M,2,0),\"\")","v":"MACAQUINHO MANGA LONGA BABY EM LYCRA GROM 5A SURF MORMAII"},{"$f":"IFERROR(IFERROR(VLOOKUP(B74,'[1]Din Rep'!$B:$M,5,0),VLOOKUP(C74,'[1]Din Rep'!$C:$M,4,0)),\"\")","v":47.90005},{"$f":"IFERROR(IFERROR(VLOOKUP(B74,'[1]Din Rep'!$B:$M,7,0),VLOOKUP(C74,'[1]Din Rep'!$C:$M,6,0)),\"\")","v":50.957500000000003},{"$f":"IFERROR(IFERROR(VLOOKUP(B74,'[1]Din Rep'!$B:$M,8,0),VLOOKUP(C74,'[1]Din Rep'!$C:$M,7,0)),\"\")","v":131.89000000000001},{"$f":"IFERROR(IFERROR(VLOOKUP(B74,'[1]Din Rep'!$B:$M,10,0),VLOOKUP(C74,'[1]Din Rep'!$C:$M,9,0)),\"\")","v":2.5882352941176472},{"$f":"IFERROR(IFERROR(VLOOKUP(B74,'[1]Din Rep'!$B:$M,11,0),VLOOKUP(C74,'[1]Din Rep'!$C:$M,10,0)),\"\")","v":0},{"$f":"IFERROR(IFERROR(VLOOKUP(B74,'[1]Din Rep'!$B:$M,12,0),VLOOKUP(C74,'[1]Din Rep'!$C:$M,11,0)),\"\")","v":"45 DD"}]
[null,"SU017B00GRO5B",{"$f":"IFERROR(VLOOKUP(B75,'[1]Din Rep'!$B:$M,2,0),\"\")","v":"MACAQUINHO MANGA LONGA BABY EM LYCRA  GROM 5B SURF MORMAII"},{"$f":"IFERROR(IFERROR(VLOOKUP(B75,'[1]Din Rep'!$B:$M,5,0),VLOOKUP(C75,'[1]Din Rep'!$C:$M,4,0)),\"\")","v":47.90005},{"$f":"IFERROR(IFERROR(VLOOKUP(B75,'[1]Din Rep'!$B:$M,7,0),VLOOKUP(C75,'[1]Din Rep'!$C:$M,6,0)),\"\")","v":50.957500000000003},{"$f":"IFERROR(IFERROR(VLOOKUP(B75,'[1]Din Rep'!$B:$M,8,0),VLOOKUP(C75,'[1]Din Rep'!$C:$M,7,0)),\"\")","v":131.89000000000001},{"$f":"IFERROR(IFERROR(VLOOKUP(B75,'[1]Din Rep'!$B:$M,10,0),VLOOKUP(C75,'[1]Din Rep'!$C:$M,9,0)),\"\")","v":2.5882352941176472},{"$f":"IFERROR(IFERROR(VLOOKUP(B75,'[1]Din Rep'!$B:$M,11,0),VLOOKUP(C75,'[1]Din Rep'!$C:$M,10,0)),\"\")","v":0},{"$f":"IFERROR(IFERROR(VLOOKUP(B75,'[1]Din Rep'!$B:$M,12,0),VLOOKUP(C75,'[1]Din Rep'!$C:$M,11,0)),\"\")","v":"45 DD"}]
[null,"SU057B00ACE2A",{"$f":"IFERROR(VLOOKUP(B76,'[1]Din Rep'!$B:$M,2,0),\"\")","v":"CHAPÉU PRAIA BABY EM MICROFIBRA REVERSIVEL MASCULINO ACESSÓRIOS 2A UV MORMAII"},{"$f":"IFERROR(IFERROR(VLOOKUP(B76,'[1]Din Rep'!$B:$M,5,0),VLOOKUP(C76,'[1]Din Rep'!$C:$M,4,0)),\"\")","v":43.905050000000003},{"$f":"IFERROR(IFERROR(VLOOKUP(B76,'[1]Din Rep'!$B:$M,7,0),VLOOKUP(C76,'[1]Din Rep'!$C:$M,6,0)),\"\")","v":46.707500000000003},{"$f":"IFERROR(IFERROR(VLOOKUP(B76,'[1]Din Rep'!$B:$M,8,0),VLOOKUP(C76,'[1]Din Rep'!$C:$M,7,0)),\"\")","v":120.89000000000001},{"$f":"IFERROR(IFERROR(VLOOKUP(B76,'[1]Din Rep'!$B:$M,10,0),VLOOKUP(C76,'[1]Din Rep'!$C:$M,9,0)),\"\")","v":2.5882352941176472},{"$f":"IFERROR(IFERROR(VLOOKUP(B76,'[1]Din Rep'!$B:$M,11,0),VLOOKUP(C76,'[1]Din Rep'!$C:$M,10,0)),\"\")","v":0},{"$f":"IFERROR(IFERROR(VLOOKUP(B76,'[1]Din Rep'!$B:$M,12,0),VLOOKUP(C76,'[1]Din Rep'!$C:$M,11,0)),\"\")","v":"45 DD"}]
[null,"SU057B00ACE2B",{"$f":"IFERROR(VLOOKUP(B77,'[1]Din Rep'!$B:$M,2,0),\"\")","v":"CHAPÉU PRAIA BABY EM MICROFIBRA REVERSIVEL FEMININO ACESSÓRIOS 2A UV MORMAII"},{"$f":"IFERROR(IFERROR(VLOOKUP(B77,'[1]Din Rep'!$B:$M,5,0),VLOOKUP(C77,'[1]Din Rep'!$C:$M,4,0)),\"\")","v":43.905050000000003},{"$f":"IFERROR(IFERROR(VLOOKUP(B77,'[1]Din Rep'!$B:$M,7,0),VLOOKUP(C77,'[1]Din Rep'!$C:$M,6,0)),\"\")","v":46.707500000000003},{"$f":"IFERROR(IFERROR(VLOOKUP(B77,'[1]Din Rep'!$B:$M,8,0),VLOOKUP(C77,'[1]Din Rep'!$C:$M,7,0)),\"\")","v":120.89000000000001},{"$f":"IFERROR(IFERROR(VLOOKUP(B77,'[1]Din Rep'!$B:$M,10,0),VLOOKUP(C77,'[1]Din Rep'!$C:$M,9,0)),\"\")","v":2.5882352941176472},{"$f":"IFERROR(IFERROR(VLOOKUP(B77,'[1]Din Rep'!$B:$M,11,0),VLOOKUP(C77,'[1]Din Rep'!$C:$M,10,0)),\"\")","v":0},{"$f":"IFERROR(IFERROR(VLOOKUP(B77,'[1]Din Rep'!$B:$M,12,0),VLOOKUP(C77,'[1]Din Rep'!$C:$M,11,0)),\"\")","v":"45 DD"}]
[null,"SU037B00GRO5A",{"$f":"IFERROR(VLOOKUP(B78,'[1]Din Rep'!$B:$M,2,0),\"\")","v":"CAMISETA MANGA LONGA BABY EM LYCRA GROM 5A SURF MORMAII"},{"$f":"IFERROR(IFERROR(VLOOKUP(B78,'[1]Din Rep'!$B:$M,5,0),VLOOKUP(C78,'[1]Din Rep'!$C:$M,4,0)),\"\")","v":39.910049999999998},{"$f":"IFERROR(IFERROR(VLOOKUP(B78,'[1]Din Rep'!$B:$M,7,0),VLOOKUP(C78,'[1]Din Rep'!$C:$M,6,0)),\"\")","v":42.457500000000003},{"$f":"IFERROR(IFERROR(VLOOKUP(B78,'[1]Din Rep'!$B:$M,8,0),VLOOKUP(C78,'[1]Din Rep'!$C:$M,7,0)),\"\")","v":109.89000000000001},{"$f":"IFERROR(IFERROR(VLOOKUP(B78,'[1]Din Rep'!$B:$M,10,0),VLOOKUP(C78,'[1]Din Rep'!$C:$M,9,0)),\"\")","v":2.5882352941176472},{"$f":"IFERROR(IFERROR(VLOOKUP(B78,'[1]Din Rep'!$B:$M,11,0),VLOOKUP(C78,'[1]Din Rep'!$C:$M,10,0)),\"\")","v":0},{"$f":"IFERROR(IFERROR(VLOOKUP(B78,'[1]Din Rep'!$B:$M,12,0),VLOOKUP(C78,'[1]Din Rep'!$C:$M,11,0)),\"\")","v":"45 DD"}]
[null,"SU037B00GRO5B",{"$f":"IFERROR(VLOOKUP(B79,'[1]Din Rep'!$B:$M,2,0),\"\")","v":"CAMISETA MANGA LONGA BABY EM LYCRA GROM 5B SURF MORMAII"},{"$f":"IFERROR(IFERROR(VLOOKUP(B79,'[1]Din Rep'!$B:$M,5,0),VLOOKUP(C79,'[1]Din Rep'!$C:$M,4,0)),\"\")","v":39.910049999999998},{"$f":"IFERROR(IFERROR(VLOOKUP(B79,'[1]Din Rep'!$B:$M,7,0),VLOOKUP(C79,'[1]Din Rep'!$C:$M,6,0)),\"\")","v":42.457500000000003},{"$f":"IFERROR(IFERROR(VLOOKUP(B79,'[1]Din Rep'!$B:$M,8,0),VLOOKUP(C79,'[1]Din Rep'!$C:$M,7,0)),\"\")","v":109.89000000000001},{"$f":"IFERROR(IFERROR(VLOOKUP(B79,'[1]Din Rep'!$B:$M,10,0),VLOOKUP(C79,'[1]Din Rep'!$C:$M,9,0)),\"\")","v":2.5882352941176472},{"$f":"IFERROR(IFERROR(VLOOKUP(B79,'[1]Din Rep'!$B:$M,11,0),VLOOKUP(C79,'[1]Din Rep'!$C:$M,10,0)),\"\")","v":0},{"$f":"IFERROR(IFERROR(VLOOKUP(B79,'[1]Din Rep'!$B:$M,12,0),VLOOKUP(C79,'[1]Din Rep'!$C:$M,11,0)),\"\")","v":"45 DD"}]
[null,"SU056B00ACE2A",{"$f":"IFERROR(VLOOKUP(B80,'[1]Din Rep'!$B:$M,2,0),\"\")","v":"BONÉ LEGIONÁRIO PRAIA BABY MASCULINO ACESSÓRIOS 2A UV MORMAII"},{"$f":"IFERROR(IFERROR(VLOOKUP(B80,'[1]Din Rep'!$B:$M,5,0),VLOOKUP(C80,'[1]Din Rep'!$C:$M,4,0)),\"\")","v":39.910049999999998},{"$f":"IFERROR(IFERROR(VLOOKUP(B80,'[1]Din Rep'!$B:$M,7,0),VLOOKUP(C80,'[1]Din Rep'!$C:$M,6,0)),\"\")","v":42.457500000000003},{"$f":"IFERROR(IFERROR(VLOOKUP(B80,'[1]Din Rep'!$B:$M,8,0),VLOOKUP(C80,'[1]Din Rep'!$C:$M,7,0)),\"\")","v":109.89000000000001},{"$f":"IFERROR(IFERROR(VLOOKUP(B80,'[1]Din Rep'!$B:$M,10,0),VLOOKUP(C80,'[1]Din Rep'!$C:$M,9,0)),\"\")","v":2.5882352941176472},{"$f":"IFERROR(IFERROR(VLOOKUP(B80,'[1]Din Rep'!$B:$M,11,0),VLOOKUP(C80,'[1]Din Rep'!$C:$M,10,0)),\"\")","v":0},{"$f":"IFERROR(IFERROR(VLOOKUP(B80,'[1]Din Rep'!$B:$M,12,0),VLOOKUP(C80,'[1]Din Rep'!$C:$M,11,0)),\"\")","v":"45 DD"}]
[null,"SU056B00ACE2B",{"$f":"IFERROR(VLOOKUP(B81,'[1]Din Rep'!$B:$M,2,0),\"\")","v":"BONÉ LEGIONÁRIO PRAIA BABY FEMININO ACESSÓRIOS 2B UV MORMAII"},{"$f":"IFERROR(IFERROR(VLOOKUP(B81,'[1]Din Rep'!$B:$M,5,0),VLOOKUP(C81,'[1]Din Rep'!$C:$M,4,0)),\"\")","v":39.910049999999998},{"$f":"IFERROR(IFERROR(VLOOKUP(B81,'[1]Din Rep'!$B:$M,7,0),VLOOKUP(C81,'[1]Din Rep'!$C:$M,6,0)),\"\")","v":42.457500000000003},{"$f":"IFERROR(IFERROR(VLOOKUP(B81,'[1]Din Rep'!$B:$M,8,0),VLOOKUP(C81,'[1]Din Rep'!$C:$M,7,0)),\"\")","v":109.89000000000001},{"$f":"IFERROR(IFERROR(VLOOKUP(B81,'[1]Din Rep'!$B:$M,10,0),VLOOKUP(C81,'[1]Din Rep'!$C:$M,9,0)),\"\")","v":2.5882352941176472},{"$f":"IFERROR(IFERROR(VLOOKUP(B81,'[1]Din Rep'!$B:$M,11,0),VLOOKUP(C81,'[1]Din Rep'!$C:$M,10,0)),\"\")","v":0},{"$f":"IFERROR(IFERROR(VLOOKUP(B81,'[1]Din Rep'!$B:$M,12,0),VLOOKUP(C81,'[1]Din Rep'!$C:$M,11,0)),\"\")","v":"45 DD"}]

{"sheet":"UV","index":2,"n_rows":40,"n_cols":9,"rows_kept":40,"cut":false,"hidden":false,"merged":[[6,0,20,0],[21,0,27,0],[28,0,36,0],[37,0,39,0]]}
[]
[]
[]
[]
[]
["LINHA","REFERENCIA","DESCRIÇÃO","À VISTA","À PRAZO","SUGESTÃO","MARK UP","IPI","ENTREGA"]
["1 - UV MASCULINO","UV037M00DAM2A",{"$f":"IFERROR(VLOOKUP(B7,'[1]Din Rep'!$B:$M,2,0),\"\")","v":"CAMISETA MANGA LONGA MASCULINO DRY ACTION 2A UV MORMAII"},{"$f":"IFERROR(IFERROR(VLOOKUP(B7,'[1]Din Rep'!$B:$M,5,0),VLOOKUP(C7,'[1]Din Rep'!$C:$M,4,0)),\"\")","v":32.64714},{"$f":"IFERROR(IFERROR(VLOOKUP(B7,'[1]Din Rep'!$B:$M,7,0),VLOOKUP(C7,'[1]Din Rep'!$C:$M,6,0)),\"\")","v":34.731000000000002},{"$f":"IFERROR(IFERROR(VLOOKUP(B7,'[1]Din Rep'!$B:$M,8,0),VLOOKUP(C7,'[1]Din Rep'!$C:$M,7,0)),\"\")","v":89.89200000000001},{"$f":"IFERROR(IFERROR(VLOOKUP(B7,'[1]Din Rep'!$B:$M,10,0),VLOOKUP(C7,'[1]Din Rep'!$C:$M,9,0)),\"\")","v":2.5882352941176472},{"$f":"IFERROR(IFERROR(VLOOKUP(B7,'[1]Din Rep'!$B:$M,11,0),VLOOKUP(C7,'[1]Din Rep'!$C:$M,10,0)),\"\")","v":0},{"$f":"IFERROR(IFERROR(VLOOKUP(B7,'[1]Din Rep'!$B:$M,12,0),VLOOKUP(C7,'[1]Din Rep'!$C:$M,11,0)),\"\")","v":"ESTOQUE"}]
[null,"UV037M00DAM2B",{"$f":"IFERROR(VLOOKUP(B8,'[1]Din Rep'!$B:$M,2,0),\"\")","v":" CAMISETA MANGA LONGA MASCULINO DRY ACTION 2B UV MORMAII"},{"$f":"IFERROR(IFERROR(VLOOKUP(B8,'[1]Din Rep'!$B:$M,5,0),VLOOKUP(C8,'[1]Din Rep'!$C:$M,4,0)),\"\")","v":32.64714},{"$f":"IFERROR(IFERROR(VLOOKUP(B8,'[1]Din Rep'!$B:$M,7,0),VLOOKUP(C8,'[1]Din Rep'!$C:$M,6,0)),\"\")","v":34.731000000000002},{"$f":"IFERROR(IFERROR(VLOOKUP(B8,'[1]Din Rep'!$B:$M,8,0),VLOOKUP(C8,'[1]Din Rep'!$C:$M,7,0)),\"\")","v":89.89200000000001},{"$f":"IFERROR(IFERROR(VLOOKUP(B8,'[1]Din Rep'!$B:$M,10,0),VLOOKUP(C8,'[1]Din Rep'!$C:$M,9,0)),\"\")","v":2.5882352941176472},{"$f":"IFERROR(IFERROR(VLOOKUP(B8,'[1]Din Rep'!$B:$M,11,0),VLOOKUP(C8,'[1]Din Rep'!$C:$M,10,0)),\"\")","v":0},{"$f":"IFERROR(IFERROR(VLOOKUP(B8,'[1]Din Rep'!$B:$M,12,0),VLOOKUP(C8,'[1]Din Rep'!$C:$M,11,0)),\"\")","v":"ESTOQUE"}]
[null,"UV037M00DCO1A",{"$f":"IFERROR(VLOOKUP(B9,'[1]Din Rep'!$B:$M,2,0),\"\")","v":" CAMISETA MANGA LONGA MASCULINO DRY CONFORT 1A UV MORMAII"},{"$f":"IFERROR(IFERROR(VLOOKUP(B9,'[1]Din Rep'!$B:$M,5,0),VLOOKUP(C9,'[1]Din Rep'!$C:$M,4,0)),\"\")","v":43.545499999999997},{"$f":"IFERROR(IFERROR(VLOOKUP(B9,'[1]Din Rep'!$B:$M,7,0),VLOOKUP(C9,'[1]Din Rep'!$C:$M,6,0)),\"\")","v":46.324999999999996},{"$f":"IFERROR(IFERROR(VLOOKUP(B9,'[1]Din Rep'!$B:$M,8,0),VLOOKUP(C9,'[1]Din Rep'!$C:$M,7,0)),\"\")","v":119.9},{"$f":"IFERROR(IFERROR(VLOOKUP(B9,'[1]Din Rep'!$B:$M,10,0),VLOOKUP(C9,'[1]Din Rep'!$C:$M,9,0)),\"\")","v":2.5882352941176476},{"$f":"IFERROR(IFERROR(VLOOKUP(B9,'[1]Din Rep'!$B:$M,11,0),VLOOKUP(C9,'[1]Din Rep'!$C:$M,10,0)),\"\")","v":0},{"$f":"IFERROR(IFERROR(VLOOKUP(B9,'[1]Din Rep'!$B:$M,12,0),VLOOKUP(C9,'[1]Din Rep'!$C:$M,11,0)),\"\")","v":"ESTOQUE"}]
[null,"UV037M00DCO1B",{"$f":"IFERROR(VLOOKUP(B10,'[1]Din Rep'!$B:$M,2,0),\"\")","v":" CAMISETA MANGA LONGA MASCULINO DRY CONFORT 1B UV MORMAII"},{"$f":"IFERROR(IFERROR(VLOOKUP(B10,'[1]Din Rep'!$B:$M,5,0),VLOOKUP(C10,'[1]Din Rep'!$C:$M,4,0)),\"\")","v":43.545499999999997},{"$f":"IFERROR(IFERROR(VLOOKUP(B10,'[1]Din Rep'!$B:$M,7,0),VLOOKUP(C10,'[1]Din Rep'!$C:$M,6,0)),\"\")","v":46.324999999999996},{"$f":"IFERROR(IFERROR(VLOOKUP(B10,'[1]Din Rep'!$B:$M,8,0),VLOOKUP(C10,'[1]Din Rep'!$C:$M,7,0)),\"\")","v":119.9},{"$f":"IFERROR(IFERROR(VLOOKUP(B10,'[1]Din Rep'!$B:$M,10,0),VLOOKUP(C10,'[1]Din Rep'!$C:$M,9,0)),\"\")","v":2.5882352941176476},{"$f":"IFERROR(IFERROR(VLOOKUP(B10,'[1]Din Rep'!$B:$M,11,0),VLOOKUP(C10,'[1]Din Rep'!$C:$M,10,0)),\"\")","v":0},{"$f":"IFERROR(IFERROR(VLOOKUP(B10,'[1]Din Rep'!$B:$M,12,0),VLOOKUP(C10,'[1]Din Rep'!$C:$M,11,0)),\"\")","v":"ESTOQUE"}]
[null,"UV037M00DFX2A",{"$f":"IFERROR(VLOOKUP(B11,'[1]Din Rep'!$B:$M,2,0),\"\")","v":" CAMISETA MANGA LONGA MASCULINO DRY FLEX 2A UV MORMAII"},{"$f":"IFERROR(IFERROR(VLOOKUP(B11,'[1]Din Rep'!$B:$M,5,0),VLOOKUP(C11,'[1]Din Rep'!$C:$M,4,0)),\"\")","v":54.443859999999994},{"$f":"IFERROR(IFERROR(VLOOKUP(B11,'[1]Din Rep'!$B:$M,7,0),VLOOKUP(C11,'[1]Din Rep'!$C:$M,6,0)),\"\")","v":57.918999999999997},{"$f":"IFERROR(IFERROR(VLOOKUP(B11,'[1]Din Rep'!$B:$M,8,0),VLOOKUP(C11,'[1]Din Rep'!$C:$M,7,0)),\"\")","v":149.90800000000002},{"$f":"IFERROR(IFERROR(VLOOKUP(B11,'[1]Din Rep'!$B:$M,10,0),VLOOKUP(C11,'[1]Din Rep'!$C:$M,9,0)),\"\")","v":2.5882352941176476},{"$f":"IFERROR(IFERROR(VLOOKUP(B11,'[1]Din Rep'!$B:$M,11,0),VLOOKUP(C11,'[1]Din Rep'!$C:$M,10,0)),\"\")","v":0},{"$f":"IFERROR(IFERROR(VLOOKUP(B11,'[1]Din Rep'!$B:$M,12,0),VLOOKUP(C11,'[1]Din Rep'!$C:$M,11,0)),\"\")","v":"ESTOQUE"}]
[null,"UV037M00DFX2B",{"$f":"IFERROR(VLOOKUP(B12,'[1]Din Rep'!$B:$M,2,0),\"\")","v":" CAMISETA MANGA LONGA MASCULINO DRY FLEX 2B UV MORMAII"},{"$f":"IFERROR(IFERROR(VLOOKUP(B12,'[1]Din Rep'!$B:$M,5,0),VLOOKUP(C12,'[1]Din Rep'!$C:$M,4,0)),\"\")","v":54.443859999999994},{"$f":"IFERROR(IFERROR(VLOOKUP(B12,'[1]Din Rep'!$B:$M,7,0),VLOOKUP(C12,'[1]Din Rep'!$C:$M,6,0)),\"\")","v":57.918999999999997},{"$f":"IFERROR(IFERROR(VLOOKUP(B12,'[1]Din Rep'!$B:$M,8,0),VLOOKUP(C12,'[1]Din Rep'!$C:$M,7,0)),\"\")","v":149.90800000000002},{"$f":"IFERROR(IFERROR(VLOOKUP(B12,'[1]Din Rep'!$B:$M,10,0),VLOOKUP(C12,'[1]Din Rep'!$C:$M,9,0)),\"\")","v":2.5882352941176476},{"$f":"IFERROR(IFERROR(VLOOKUP(B12,'[1]Din Rep'!$B:$M,11,0),VLOOKUP(C12,'[1]Din Rep'!$C:$M,10,0)),\"\")","v":0},{"$f":"IFERROR(IFERROR(VLOOKUP(B12,'[1]Din Rep'!$B:$M,12,0),VLOOKUP(C12,'[1]Din Rep'!$C:$M,11,0)),\"\")","v":"ESTOQUE"}]
[null,"UV038M00DCO1A",{"$f":"IFERROR(VLOOKUP(B13,'[1]Din Rep'!$B:$M,2,0),\"\")","v":" CAMISETA MANGA LONGA C/ CAPUZ MASCULINO DRY CONFORT 1A UV MORMAII"},{"$f":"IFERROR(IFERROR(VLOOKUP(B13,'[1]Din Rep'!$B:$M,5,0),VLOOKUP(C13,'[1]Din Rep'!$C:$M,4,0)),\"\")","v":50.808410000000002},{"$f":"IFERROR(IFERROR(VLOOKUP(B13,'[1]Din Rep'!$B:$M,7,0),VLOOKUP(C13,'[1]Din Rep'!$C:$M,6,0)),\"\")","v":54.051500000000004},{"$f":"IFERROR(IFERROR(VLOOKUP(B13,'[1]Din Rep'!$B:$M,8,0),VLOOKUP(C13,'[1]Din Rep'!$C:$M,7,0)),\"\")","v":139.89800000000002},{"$f":"IFERROR(IFERROR(VLOOKUP(B13,'[1]Din Rep'!$B:$M,10,0),VLOOKUP(C13,'[1]Din Rep'!$C:$M,9,0)),\"\")","v":2.5882352941176472},{"$f":"IFERROR(IFERROR(VLOOKUP(B13,'[1]Din Rep'!$B:$M,11,0),VLOOKUP(C13,'[1]Din Rep'!$C:$M,10,0)),\"\")","v":0},{"$f":"IFERROR(IFERROR(VLOOKUP(B13,'[1]Din Rep'!$B:$M,12,0),VLOOKUP(C13,'[1]Din Rep'!$C:$M,11,0)),\"\")","v":"ESTOQUE"}]
[null,"UV038M00DCO1B",{"$f":"IFERROR(VLOOKUP(B14,'[1]Din Rep'!$B:$M,2,0),\"\")","v":" CAMISETA MANGA LONGA C/ CAPUZ MASCULINO DRY CONFORT 1B UV MORMAII"},{"$f":"IFERROR(IFERROR(VLOOKUP(B14,'[1]Din Rep'!$B:$M,5,0),VLOOKUP(C14,'[1]Din Rep'!$C:$M,4,0)),\"\")","v":54.443859999999994},{"$f":"IFERROR(IFERROR(VLOOKUP(B14,'[1]Din Rep'!$B:$M,7,0),VLOOKUP(C14,'[1]Din Rep'!$C:$M,6,0)),\"\")","v":57.918999999999997},{"$f":"IFERROR(IFERROR(VLOOKUP(B14,'[1]Din Rep'!$B:$M,8,0),VLOOKUP(C14,'[1]Din Rep'!$C:$M,7,0)),\"\")","v":149.90800000000002},{"$f":"IFERROR(IFERROR(VLOOKUP(B14,'[1]Din Rep'!$B:$M,10,0),VLOOKUP(C14,'[1]Din Rep'!$C:$M,9,0)),\"\")","v":2.5882352941176476},{"$f":"IFERROR(IFERROR(VLOOKUP(B14,'[1]Din Rep'!$B:$M,11,0),VLOOKUP(C14,'[1]Din Rep'!$C:$M,10,0)),\"\")","v":0},{"$f":"IFERROR(IFERROR(VLOOKUP(B14,'[1]Din Rep'!$B:$M,12,0),VLOOKUP(C14,'[1]Din Rep'!$C:$M,11,0)),\"\")","v":"ESTOQUE"}]
[null,"UV038M00DCO1C",{"$f":"IFERROR(VLOOKUP(B15,'[1]Din Rep'!$B:$M,2,0),\"\")","v":" CAMISETA MANGA LONGA C/ CAPUZ MASCULINO DRY CONFORT 1C UV MORMAII"},{"$f":"IFERROR(IFERROR(VLOOKUP(B15,'[1]Din Rep'!$B:$M,5,0),VLOOKUP(C15,'[1]Din Rep'!$C:$M,4,0)),\"\")","v":58.07132},{"$f":"IFERROR(IFERROR(VLOOKUP(B15,'[1]Din Rep'!$B:$M,7,0),VLOOKUP(C15,'[1]Din Rep'!$C:$M,6,0)),\"\")","v":61.778000000000006},{"$f":"IFERROR(IFERROR(VLOOKUP(B15,'[1]Din Rep'!$B:$M,8,0),VLOOKUP(C15,'[1]Din Rep'!$C:$M,7,0)),\"\")","v":159.89600000000002},{"$f":"IFERROR(IFERROR(VLOOKUP(B15,'[1]Din Rep'!$B:$M,10,0),VLOOKUP(C15,'[1]Din Rep'!$C:$M,9,0)),\"\")","v":2.5882352941176472},{"$f":"IFERROR(IFERROR(VLOOKUP(B15,'[1]Din Rep'!$B:$M,11,0),VLOOKUP(C15,'[1]Din Rep'!$C:$M,10,0)),\"\")","v":0},{"$f":"IFERROR(IFERROR(VLOOKUP(B15,'[1]Din Rep'!$B:$M,12,0),VLOOKUP(C15,'[1]Din Rep'!$C:$M,11,0)),\"\")","v":"ESTOQUE"}]
[null,"UV041M00DAM2A",{"$f":"IFERROR(VLOOKUP(B16,'[1]Din Rep'!$B:$M,2,0),\"\")","v":" CAMISETA MANGA CURTA MASCULINO DRY ACTION 2A UV MORMAII"},{"$f":"IFERROR(IFERROR(VLOOKUP(B16,'[1]Din Rep'!$B:$M,5,0),VLOOKUP(C16,'[1]Din Rep'!$C:$M,4,0)),\"\")","v":29.019679999999997},{"$f":"IFERROR(IFERROR(VLOOKUP(B16,'[1]Din Rep'!$B:$M,7,0),VLOOKUP(C16,'[1]Din Rep'!$C:$M,6,0)),\"\")","v":30.872},{"$f":"IFERROR(IFERROR(VLOOKUP(B16,'[1]Din Rep'!$B:$M,8,0),VLOOKUP(C16,'[1]Din Rep'!$C:$M,7,0)),\"\")","v":79.904000000000011},{"$f":"IFERROR(IFERROR(VLOOKUP(B16,'[1]Din Rep'!$B:$M,10,0),VLOOKUP(C16,'[1]Din Rep'!$C:$M,9,0)),\"\")","v":2.5882352941176472},{"$f":"IFERROR(IFERROR(VLOOKUP(B16,'[1]Din Rep'!$B:$M,11,0),VLOOKUP(C16,'[1]Din Rep'!$C:$M,10,0)),\"\")","v":0},{"$f":"IFERROR(IFERROR(VLOOKUP(B16,'[1]Din Rep'!$B:$M,12,0),VLOOKUP(C16,'[1]Din Rep'!$C:$M,11,0)),\"\")","v":"ESTOQUE"}]
[null,"UV041M00DAM2B",{"$f":"IFERROR(VLOOKUP(B17,'[1]Din Rep'!$B:$M,2,0),\"\")","v":" CAMISETA MANGA CURTA MASCULINO DRY ACTION 2B UV MORMAII"},{"$f":"IFERROR(IFERROR(VLOOKUP(B17,'[1]Din Rep'!$B:$M,5,0),VLOOKUP(C17,'[1]Din Rep'!$C:$M,4,0)),\"\")","v":29.019679999999997},{"$f":"IFERROR(IFERROR(VLOOKUP(B17,'[1]Din Rep'!$B:$M,7,0),VLOOKUP(C17,'[1]Din Rep'!$C:$M,6,0)),\"\")","v":30.872},{"$f":"IFERROR(IFERROR(VLOOKUP(B17,'[1]Din Rep'!$B:$M,8,0),VLOOKUP(C17,'[1]Din Rep'!$C:$M,7,0)),\"\")","v":79.904000000000011},{"$f":"IFERROR(IFERROR(VLOOKUP(B17,'[1]Din Rep'!$B:$M,10,0),VLOOKUP(C17,'[1]Din Rep'!$C:$M,9,0)),\"\")","v":2.5882352941176472},{"$f":"IFERROR(IFERROR(VLOOKUP(B17,'[1]Din Rep'!$B:$M,11,0),VLOOKUP(C17,'[1]Din Rep'!$C:$M,10,0)),\"\")","v":0},{"$f":"IFERROR(IFERROR(VLOOKUP(B17,'[1]Din Rep'!$B:$M,12,0),VLOOKUP(C17,'[1]Din Rep'!$C:$M,11,0)),\"\")","v":"ESTOQUE"}]
[null,"UV041M00DAM2C",{"$f":"IFERROR(VLOOKUP(B18,'[1]Din Rep'!$B:$M,2,0),\"\")","v":" CAMISETA MANGA CURTA MASCULINO DRY ACTION 2C UV MORMAII"},{"$f":"IFERROR(IFERROR(VLOOKUP(B18,'[1]Din Rep'!$B:$M,5,0),VLOOKUP(C18,'[1]Din Rep'!$C:$M,4,0)),\"\")","v":29.019679999999997},{"$f":"IFERROR(IFERROR(VLOOKUP(B18,'[1]Din Rep'!$B:$M,7,0),VLOOKUP(C18,'[1]Din Rep'!$C:$M,6,0)),\"\")","v":30.872},{"$f":"IFERROR(IFERROR(VLOOKUP(B18,'[1]Din Rep'!$B:$M,8,0),VLOOKUP(C18,'[1]Din Rep'!$C:$M,7,0)),\"\")","v":79.904000000000011},{"$f":"IFERROR(IFERROR(VLOOKUP(B18,'[1]Din Rep'!$B:$M,10,0),VLOOKUP(C18,'[1]Din Rep'!$C:$M,9,0)),\"\")","v":2.5882352941176472},{"$f":"IFERROR(IFERROR(VLOOKUP(B18,'[1]Din Rep'!$B:$M,11,0),VLOOKUP(C18,'[1]Din Rep'!$C:$M,10,0)),\"\")","v":0},{"$f":"IFERROR(IFERROR(VLOOKUP(B18,'[1]Din Rep'!$B:$M,12,0),VLOOKUP(C18,'[1]Din Rep'!$C:$M,11,0)),\"\")","v":"ESTOQUE"}]
[null,"UV041M00DCO1A",{"$f":"IFERROR(VLOOKUP(B19,'[1]Din Rep'!$B:$M,2,0),\"\")","v":" CAMISETA MANGA CURTA MASCULINO DRY CONFORT 1A UV MORMAII"},{"$f":"IFERROR(IFERROR(VLOOKUP(B19,'[1]Din Rep'!$B:$M,5,0),VLOOKUP(C19,'[1]Din Rep'!$C:$M,4,0)),\"\")","v":39.910049999999998},{"$f":"IFERROR(IFERROR(VLOOKUP(B19,'[1]Din Rep'!$B:$M,7,0),VLOOKUP(C19,'[1]Din Rep'!$C:$M,6,0)),\"\")","v":42.457500000000003},{"$f":"IFERROR(IFERROR(VLOOKUP(B19,'[1]Din Rep'!$B:$M,8,0),VLOOKUP(C19,'[1]Din Rep'!$C:$M,7,0)),\"\")","v":109.89000000000001},{"$f":"IFERROR(IFERROR(VLOOKUP(B19,'[1]Din Rep'!$B:$M,10,0),VLOOKUP(C19,'[1]Din Rep'!$C:$M,9,0)),\"\")","v":2.5882352941176472},{"$f":"IFERROR(IFERROR(VLOOKUP(B19,'[1]Din Rep'!$B:$M,11,0),VLOOKUP(C19,'[1]Din Rep'!$C:$M,10,0)),\"\")","v":0},{"$f":"IFERROR(IFERROR(VLOOKUP(B19,'[1]Din Rep'!$B:$M,12,0),VLOOKUP(C19,'[1]Din Rep'!$C:$M,11,0)),\"\")","v":"ESTOQUE"}]
[null,"UV041M00DCO1B",{"$f":"IFERROR(VLOOKUP(B20,'[1]Din Rep'!$B:$M,2,0),\"\")","v":" CAMISETA MANGA CURTA MASCULINO DRY CONFORT 1B UV MORMAII"},{"$f":"IFERROR(IFERROR(VLOOKUP(B20,'[1]Din Rep'!$B:$M,5,0),VLOOKUP(C20,'[1]Din Rep'!$C:$M,4,0)),\"\")","v":39.910049999999998},{"$f":"IFERROR(IFERROR(VLOOKUP(B20,'[1]Din Rep'!$B:$M,7,0),VLOOKUP(C20,'[1]Din Rep'!$C:$M,6,0)),\"\")","v":42.457500000000003},{"$f":"IFERROR(IFERROR(VLOOKUP(B20,'[1]Din Rep'!$B:$M,8,0),VLOOKUP(C20,'[1]Din Rep'!$C:$M,7,0)),\"\")","v":109.89000000000001},{"$f":"IFERROR(IFERROR(VLOOKUP(B20,'[1]Din Rep'!$B:$M,10,0),VLOOKUP(C20,'[1]Din Rep'!$C:$M,9,0)),\"\")","v":2.5882352941176472},{"$f":"IFERROR(IFERROR(VLOOKUP(B20,'[1]Din Rep'!$B:$M,11,0),VLOOKUP(C20,'[1]Din Rep'!$C:$M,10,0)),\"\")","v":0},{"$f":"IFERROR(IFERROR(VLOOKUP(B20,'[1]Din Rep'!$B:$M,12,0),VLOOKUP(C20,'[1]Din Rep'!$C:$M,11,0)),\"\")","v":"ESTOQUE"}]
[null,"UV041M00DFX2A",{"$f":"IFERROR(VLOOKUP(B21,'[1]Din Rep'!$B:$M,2,0),\"\")","v":" CAMISETA MANGA CURTA MASCULINO DRY FLEX 2A UV MORMAII"},{"$f":"IFERROR(IFERROR(VLOOKUP(B21,'[1]Din Rep'!$B:$M,5,0),VLOOKUP(C21,'[1]Din Rep'!$C:$M,4,0)),\"\")","v":50.808410000000002},{"$f":"IFERROR(IFERROR(VLOOKUP(B21,'[1]Din Rep'!$B:$M,7,0),VLOOKUP(C21,'[1]Din Rep'!$C:$M,6,0)),\"\")","v":54.051500000000004},{"$f":"IFERROR(IFERROR(VLOOKUP(B21,'[1]Din Rep'!$B:$M,8,0),VLOOKUP(C21,'[1]Din Rep'!$C:$M,7,0)),\"\")","v":139.89800000000002},{"$f":"IFERROR(IFERROR(VLOOKUP(B21,'[1]Din Rep'!$B:$M,10,0),VLOOKUP(C21,'[1]Din Rep'!$C:$M,9,0)),\"\")","v":2.5882352941176472},{"$f":"IFERROR(IFERROR(VLOOKUP(B21,'[1]Din Rep'!$B:$M,11,0),VLOOKUP(C21,'[1]Din Rep'!$C:$M,10,0)),\"\")","v":0},{"$f":"IFERROR(IFERROR(VLOOKUP(B21,'[1]Din Rep'!$B:$M,12,0),VLOOKUP(C21,'[1]Din Rep'!$C:$M,11,0)),\"\")","v":"ESTOQUE"}]
["2 - UV FEMININO","UV037F00DAM2A",{"$f":"IFERROR(VLOOKUP(B22,'[1]Din Rep'!$B:$M,2,0),\"\")","v":" CAMISETA MANGA LONGA FEMININO DRY ACTION 2A UV MORMAII"},{"$f":"IFERROR(IFERROR(VLOOKUP(B22,'[1]Din Rep'!$B:$M,5,0),VLOOKUP(C22,'[1]Din Rep'!$C:$M,4,0)),\"\")","v":32.64714},{"$f":"IFERROR(IFERROR(VLOOKUP(B22,'[1]Din Rep'!$B:$M,7,0),VLOOKUP(C22,'[1]Din Rep'!$C:$M,6,0)),\"\")","v":34.731000000000002},{"$f":"IFERROR(IFERROR(VLOOKUP(B22,'[1]Din Rep'!$B:$M,8,0),VLOOKUP(C22,'[1]Din Rep'!$C:$M,7,0)),\"\")","v":89.89200000000001},{"$f":"IFERROR(IFERROR(VLOOKUP(B22,'[1]Din Rep'!$B:$M,10,0),VLOOKUP(C22,'[1]Din Rep'!$C:$M,9,0)),\"\")","v":2.5882352941176472},{"$f":"IFERROR(IFERROR(VLOOKUP(B22,'[1]Din Rep'!$B:$M,11,0),VLOOKUP(C22,'[1]Din Rep'!$C:$M,10,0)),\"\")","v":0},{"$f":"IFERROR(IFERROR(VLOOKUP(B22,'[1]Din Rep'!$B:$M,12,0),VLOOKUP(C22,'[1]Din Rep'!$C:$M,11,0)),\"\")","v":"ESTOQUE"}]
[null,"UV037F00DAM2B",{"$f":"IFERROR(VLOOKUP(B23,'[1]Din Rep'!$B:$M,2,0),\"\")","v":"CAMISETA MANGA LONGA FEMININO DRY ACTION 2B UV MORMAII"},{"$f":"IFERROR(IFERROR(VLOOKUP(B23,'[1]Din Rep'!$B:$M,5,0),VLOOKUP(C23,'[1]Din Rep'!$C:$M,4,0)),\"\")","v":32.64714},{"$f":"IFERROR(IFERROR(VLOOKUP(B23,'[1]Din Rep'!$B:$M,7,0),VLOOKUP(C23,'[1]Din Rep'!$C:$M,6,0)),\"\")","v":34.731000000000002},{"$f":"IFERROR(IFERROR(VLOOKUP(B23,'[1]Din Rep'!$B:$M,8,0),VLOOKUP(C23,'[1]Din Rep'!$C:$M,7,0)),\"\")","v":89.89200000000001},{"$f":"IFERROR(IFERROR(VLOOKUP(B23,'[1]Din Rep'!$B:$M,10,0),VLOOKUP(C23,'[1]Din Rep'!$C:$M,9,0)),\"\")","v":2.5882352941176472},{"$f":"IFERROR(IFERROR(VLOOKUP(B23,'[1]Din Rep'!$B:$M,11,0),VLOOKUP(C23,'[1]Din Rep'!$C:$M,10,0)),\"\")","v":0},{"$f":"IFERROR(IFERROR(VLOOKUP(B23,'[1]Din Rep'!$B:$M,12,0),VLOOKUP(C23,'[1]Din Rep'!$C:$M,11,0)),\"\")","v":"ESTOQUE"}]
[null,"UV037F00DCO1C",{"$f":"IFERROR(VLOOKUP(B24,'[1]Din Rep'!$B:$M,2,0),\"\")","v":" CAMISETA MANGA LONGA FEMININO DRY CONFORT 1C UV MORMAII"},{"$f":"IFERROR(IFERROR(VLOOKUP(B24,'[1]Din Rep'!$B:$M,5,0),VLOOKUP(C24,'[1]Din Rep'!$C:$M,4,0)),\"\")","v":43.545499999999997},{"$f":"IFERROR(IFERROR(VLOOKUP(B24,'[1]Din Rep'!$B:$M,7,0),VLOOKUP(C24,'[1]Din Rep'!$C:$M,6,0)),\"\")","v":46.324999999999996},{"$f":"IFERROR(IFERROR(VLOOKUP(B24,'[1]Din Rep'!$B:$M,8,0),VLOOKUP(C24,'[1]Din Rep'!$C:$M,7,0)),\"\")","v":119.9},{"$f":"IFERROR(IFERROR(VLOOKUP(B24,'[1]Din Rep'!$B:$M,10,0),VLOOKUP(C24,'[1]Din Rep'!$C:$M,9,0)),\"\")","v":2.5882352941176476},{"$f":"IFERROR(IFERROR(VLOOKUP(B24,'[1]Din Rep'!$B:$M,11,0),VLOOKUP(C24,'[1]Din Rep'!$C:$M,10,0)),\"\")","v":0},{"$f":"IFERROR(IFERROR(VLOOKUP(B24,'[1]Din Rep'!$B:$M,12,0),VLOOKUP(C24,'[1]Din Rep'!$C:$M,11,0)),\"\")","v":"ESTOQUE"}]
[null,"UV037F00DFX2A",{"$f":"IFERROR(VLOOKUP(B25,'[1]Din Rep'!$B:$M,2,0),\"\")","v":" CAMISETA MANGA LONGA FEMININO DRY FLEX 2A UV MORMAII"},{"$f":"IFERROR(IFERROR(VLOOKUP(B25,'[1]Din Rep'!$B:$M,5,0),VLOOKUP(C25,'[1]Din Rep'!$C:$M,4,0)),\"\")","v":54.443859999999994},{"$f":"IFERROR(IFERROR(VLOOKUP(B25,'[1]Din Rep'!$B:$M,7,0),VLOOKUP(C25,'[1]Din Rep'!$C:$M,6,0)),\"\")","v":57.918999999999997},{"$f":"IFERROR(IFERROR(VLOOKUP(B25,'[1]Din Rep'!$B:$M,8,0),VLOOKUP(C25,'[1]Din Rep'!$C:$M,7,0)),\"\")","v":149.90800000000002},{"$f":"IFERROR(IFERROR(VLOOKUP(B25,'[1]Din Rep'!$B:$M,10,0),VLOOKUP(C25,'[1]Din Rep'!$C:$M,9,0)),\"\")","v":2.5882352941176476},{"$f":"IFERROR(IFERROR(VLOOKUP(B25,'[1]Din Rep'!$B:$M,11,0),VLOOKUP(C25,'[1]Din Rep'!$C:$M,10,0)),\"\")","v":0},{"$f":"IFERROR(IFERROR(VLOOKUP(B25,'[1]Din Rep'!$B:$M,12,0),VLOOKUP(C25,'[1]Din Rep'!$C:$M,11,0)),\"\")","v":"ESTOQUE"}]
[null,"UV041F00DAM2A",{"$f":"IFERROR(VLOOKUP(B26,'[1]Din Rep'!$B:$M,2,0),\"\")","v":" CAMISETA MANGA CURTA FEMININO DRY ACTION 2A UV MORMAII"},{"$f":"IFERROR(IFERROR(VLOOKUP(B26,'[1]Din Rep'!$B:$M,5,0),VLOOKUP(C26,'[1]Din Rep'!$C:$M,4,0)),\"\")","v":29.019679999999997},{"$f":"IFERROR(IFERROR(VLOOKUP(B26,'[1]Din Rep'!$B:$M,7,0),VLOOKUP(C26,'[1]Din Rep'!$C:$M,6,0)),\"\")","v":30.872},{"$f":"IFERROR(IFERROR(VLOOKUP(B26,'[1]Din Rep'!$B:$M,8,0),VLOOKUP(C26,'[1]Din Rep'!$C:$M,7,0)),\"\")","v":79.904000000000011},{"$f":"IFERROR(IFERROR(VLOOKUP(B26,'[1]Din Rep'!$B:$M,10,0),VLOOKUP(C26,'[1]Din Rep'!$C:$M,9,0)),\"\")","v":2.5882352941176472},{"$f":"IFERROR(IFERROR(VLOOKUP(B26,'[1]Din Rep'!$B:$M,11,0),VLOOKUP(C26,'[1]Din Rep'!$C:$M,10,0)),\"\")","v":0},{"$f":"IFERROR(IFERROR(VLOOKUP(B26,'[1]Din Rep'!$B:$M,12,0),VLOOKUP(C26,'[1]Din Rep'!$C:$M,11,0)),\"\")","v":"ESTOQUE"}]
[null,"UV041F00DAM2B",{"$f":"IFERROR(VLOOKUP(B27,'[1]Din Rep'!$B:$M,2,0),\"\")","v":" CAMISETA MANGA CURTA FEMININO DRY ACTION 2B UV MORMAII"},{"$f":"IFERROR(IFERROR(VLOOKUP(B27,'[1]Din Rep'!$B:$M,5,0),VLOOKUP(C27,'[1]Din Rep'!$C:$M,4,0)),\"\")","v":29.019679999999997},{"$f":"IFERROR(IFERROR(VLOOKUP(B27,'[1]Din Rep'!$B:$M,7,0),VLOOKUP(C27,'[1]Din Rep'!$C:$M,6,0)),\"\")","v":30.872},{"$f":"IFERROR(IFERROR(VLOOKUP(B27,'[1]Din Rep'!$B:$M,8,0),VLOOKUP(C27,'[1]Din Rep'!$C:$M,7,0)),\"\")","v":79.904000000000011},{"$f":"IFERROR(IFERROR(VLOOKUP(B27,'[1]Din Rep'!$B:$M,10,0),VLOOKUP(C27,'[1]Din Rep'!$C:$M,9,0)),\"\")","v":2.5882352941176472},{"$f":"IFERROR(IFERROR(VLOOKUP(B27,'[1]Din Rep'!$B:$M,11,0),VLOOKUP(C27,'[1]Din Rep'!$C:$M,10,0)),\"\")","v":0},{"$f":"IFERROR(IFERROR(VLOOKUP(B27,'[1]Din Rep'!$B:$M,12,0),VLOOKUP(C27,'[1]Din Rep'!$C:$M,11,0)),\"\")","v":"ESTOQUE"}]
[null,"UV041F00DFX2A",{"$f":"IFERROR(VLOOKUP(B28,'[1]Din Rep'!$B:$M,2,0),\"\")","v":"CAMISETA MANGA CURTA FEMININO DRY FLEX 2A UV MORMAII"},{"$f":"IFERROR(IFERROR(VLOOKUP(B28,'[1]Din Rep'!$B:$M,5,0),VLOOKUP(C28,'[1]Din Rep'!$C:$M,4,0)),\"\")","v":50.808410000000002},{"$f":"IFERROR(IFERROR(VLOOKUP(B28,'[1]Din Rep'!$B:$M,7,0),VLOOKUP(C28,'[1]Din Rep'!$C:$M,6,0)),\"\")","v":54.051500000000004},{"$f":"IFERROR(IFERROR(VLOOKUP(B28,'[1]Din Rep'!$B:$M,8,0),VLOOKUP(C28,'[1]Din Rep'!$C:$M,7,0)),\"\")","v":139.89800000000002},{"$f":"IFERROR(IFERROR(VLOOKUP(B28,'[1]Din Rep'!$B:$M,10,0),VLOOKUP(C28,'[1]Din Rep'!$C:$M,9,0)),\"\")","v":2.5882352941176472},{"$f":"IFERROR(IFERROR(VLOOKUP(B28,'[1]Din Rep'!$B:$M,11,0),VLOOKUP(C28,'[1]Din Rep'!$C:$M,10,0)),\"\")","v":0},{"$f":"IFERROR(IFERROR(VLOOKUP(B28,'[1]Din Rep'!$B:$M,12,0),VLOOKUP(C28,'[1]Din Rep'!$C:$M,11,0)),\"\")","v":"ESTOQUE"}]
["3 - INFANTIL MASCULINO","UV037I00DAM2A",{"$f":"IFERROR(VLOOKUP(B29,'[1]Din Rep'!$B:$M,2,0),\"\")","v":" CAMISETA MANGA LONGA INFANTIL DRY ACTION 2A UV MORMAII"},{"$f":"IFERROR(IFERROR(VLOOKUP(B29,'[1]Din Rep'!$B:$M,5,0),VLOOKUP(C29,'[1]Din Rep'!$C:$M,4,0)),\"\")","v":32.64714},{"$f":"IFERROR(IFERROR(VLOOKUP(B29,'[1]Din Rep'!$B:$M,7,0),VLOOKUP(C29,'[1]Din Rep'!$C:$M,6,0)),\"\")","v":34.731000000000002},{"$f":"IFERROR(IFERROR(VLOOKUP(B29,'[1]Din Rep'!$B:$M,8,0),VLOOKUP(C29,'[1]Din Rep'!$C:$M,7,0)),\"\")","v":89.89200000000001},{"$f":"IFERROR(IFERROR(VLOOKUP(B29,'[1]Din Rep'!$B:$M,10,0),VLOOKUP(C29,'[1]Din Rep'!$C:$M,9,0)),\"\")","v":2.5882352941176472},{"$f":"IFERROR(IFERROR(VLOOKUP(B29,'[1]Din Rep'!$B:$M,11,0),VLOOKUP(C29,'[1]Din Rep'!$C:$M,10,0)),\"\")","v":0},{"$f":"IFERROR(IFERROR(VLOOKUP(B29,'[1]Din Rep'!$B:$M,12,0),VLOOKUP(C29,'[1]Din Rep'!$C:$M,11,0)),\"\")","v":"ESTOQUE"}]
[null,"UV037I00DAM2B",{"$f":"IFERROR(VLOOKUP(B30,'[1]Din Rep'!$B:$M,2,0),\"\")","v":" CAMISETA MANGA LONGA INFANTIL DRY ACTION 2B UV MORMAII"},{"$f":"IFERROR(IFERROR(VLOOKUP(B30,'[1]Din Rep'!$B:$M,5,0),VLOOKUP(C30,'[1]Din Rep'!$C:$M,4,0)),\"\")","v":32.64714},{"$f":"IFERROR(IFERROR(VLOOKUP(B30,'[1]Din Rep'!$B:$M,7,0),VLOOKUP(C30,'[1]Din Rep'!$C:$M,6,0)),\"\")","v":34.731000000000002},{"$f":"IFERROR(IFERROR(VLOOKUP(B30,'[1]Din Rep'!$B:$M,8,0),VLOOKUP(C30,'[1]Din Rep'!$C:$M,7,0)),\"\")","v":89.89200000000001},{"$f":"IFERROR(IFERROR(VLOOKUP(B30,'[1]Din Rep'!$B:$M,10,0),VLOOKUP(C30,'[1]Din Rep'!$C:$M,9,0)),\"\")","v":2.5882352941176472},{"$f":"IFERROR(IFERROR(VLOOKUP(B30,'[1]Din Rep'!$B:$M,11,0),VLOOKUP(C30,'[1]Din Rep'!$C:$M,10,0)),\"\")","v":0},{"$f":"IFERROR(IFERROR(VLOOKUP(B30,'[1]Din Rep'!$B:$M,12,0),VLOOKUP(C30,'[1]Din Rep'!$C:$M,11,0)),\"\")","v":"ESTOQUE"}]
[null,"UV037I00DFX2A",{"$f":"IFERROR(VLOOKUP(B31,'[1]Din Rep'!$B:$M,2,0),\"\")","v":" CAMISETA MANGA LONGA INFANTIL DRY FLEX 2A UV MORMAII"},{"$f":"IFERROR(IFERROR(VLOOKUP(B31,'[1]Din Rep'!$B:$M,5,0),VLOOKUP(C31,'[1]Din Rep'!$C:$M,4,0)),\"\")","v":54.443859999999994},{"$f":"IFERROR(IFERROR(VLOOKUP(B31,'[1]Din Rep'!$B:$M,7,0),VLOOKUP(C31,'[1]Din Rep'!$C:$M,6,0)),\"\")","v":57.918999999999997},{"$f":"IFERROR(IFERROR(VLOOKUP(B31,'[1]Din Rep'!$B:$M,8,0),VLOOKUP(C31,'[1]Din Rep'!$C:$M,7,0)),\"\")","v":149.90800000000002},{"$f":"IFERROR(IFERROR(VLOOKUP(B31,'[1]Din Rep'!$B:$M,10,0),VLOOKUP(C31,'[1]Din Rep'!$C:$M,9,0)),\"\")","v":2.5882352941176476},{"$f":"IFERROR(IFERROR(VLOOKUP(B31,'[1]Din Rep'!$B:$M,11,0),VLOOKUP(C31,'[1]Din Rep'!$C:$M,10,0)),\"\")","v":0},{"$f":"IFERROR(IFERROR(VLOOKUP(B31,'[1]Din Rep'!$B:$M,12,0),VLOOKUP(C31,'[1]Din Rep'!$C:$M,11,0)),\"\")","v":"ESTOQUE"}]
[null,"UV038I00DCO1A",{"$f":"IFERROR(VLOOKUP(B32,'[1]Din Rep'!$B:$M,2,0),\"\")","v":" CAMISETA MANGA LONGA C/ CAPUZ INFANTIL DRY CONFORT 1A UV MORMAII"},{"$f":"IFERROR(IFERROR(VLOOKUP(B32,'[1]Din Rep'!$B:$M,5,0),VLOOKUP(C32,'[1]Din Rep'!$C:$M,4,0)),\"\")","v":50.808410000000002},{"$f":"IFERROR(IFERROR(VLOOKUP(B32,'[1]Din Rep'!$B:$M,7,0),VLOOKUP(C32,'[1]Din Rep'!$C:$M,6,0)),\"\")","v":54.051500000000004},{"$f":"IFERROR(IFERROR(VLOOKUP(B32,'[1]Din Rep'!$B:$M,8,0),VLOOKUP(C32,'[1]Din Rep'!$C:$M,7,0)),\"\")","v":139.89800000000002},{"$f":"IFERROR(IFERROR(VLOOKUP(B32,'[1]Din Rep'!$B:$M,10,0),VLOOKUP(C32,'[1]Din Rep'!$C:$M,9,0)),\"\")","v":2.5882352941176472},{"$f":"IFERROR(IFERROR(VLOOKUP(B32,'[1]Din Rep'!$B:$M,11,0),VLOOKUP(C32,'[1]Din Rep'!$C:$M,10,0)),\"\")","v":0},{"$f":"IFERROR(IFERROR(VLOOKUP(B32,'[1]Din Rep'!$B:$M,12,0),VLOOKUP(C32,'[1]Din Rep'!$C:$M,11,0)),\"\")","v":"ESTOQUE"}]
[null,"UV041I00DAM2A",{"$f":"IFERROR(VLOOKUP(B33,'[1]Din Rep'!$B:$M,2,0),\"\")","v":" CAMISETA MANGA CURTA INFANTIL DRY ACTION 2A UV MORMAII"},{"$f":"IFERROR(IFERROR(VLOOKUP(B33,'[1]Din Rep'!$B:$M,5,0),VLOOKUP(C33,'[1]Din Rep'!$C:$M,4,0)),\"\")","v":29.019679999999997},{"$f":"IFERROR(IFERROR(VLOOKUP(B33,'[1]Din Rep'!$B:$M,7,0),VLOOKUP(C33,'[1]Din Rep'!$C:$M,6,0)),\"\")","v":30.872},{"$f":"IFERROR(IFERROR(VLOOKUP(B33,'[1]Din Rep'!$B:$M,8,0),VLOOKUP(C33,'[1]Din Rep'!$C:$M,7,0)),\"\")","v":79.904000000000011},{"$f":"IFERROR(IFERROR(VLOOKUP(B33,'[1]Din Rep'!$B:$M,10,0),VLOOKUP(C33,'[1]Din Rep'!$C:$M,9,0)),\"\")","v":2.5882352941176472},{"$f":"IFERROR(IFERROR(VLOOKUP(B33,'[1]Din Rep'!$B:$M,11,0),VLOOKUP(C33,'[1]Din Rep'!$C:$M,10,0)),\"\")","v":0},{"$f":"IFERROR(IFERROR(VLOOKUP(B33,'[1]Din Rep'!$B:$M,12,0),VLOOKUP(C33,'[1]Din Rep'!$C:$M,11,0)),\"\")","v":"ESTOQUE"}]
[null,"UV041I00DAM2B",{"$f":"IFERROR(VLOOKUP(B34,'[1]Din Rep'!$B:$M,2,0),\"\")","v":" CAMISETA MANGA CURTA INFANTIL DRY ACTION 2B UV MORMAII"},{"$f":"IFERROR(IFERROR(VLOOKUP(B34,'[1]Din Rep'!$B:$M,5,0),VLOOKUP(C34,'[1]Din Rep'!$C:$M,4,0)),\"\")","v":29.019679999999997},{"$f":"IFERROR(IFERROR(VLOOKUP(B34,'[1]Din Rep'!$B:$M,7,0),VLOOKUP(C34,'[1]Din Rep'!$C:$M,6,0)),\"\")","v":30.872},{"$f":"IFERROR(IFERROR(VLOOKUP(B34,'[1]Din Rep'!$B:$M,8,0),VLOOKUP(C34,'[1]Din Rep'!$C:$M,7,0)),\"\")","v":79.904000000000011},{"$f":"IFERROR(IFERROR(VLOOKUP(B34,'[1]Din Rep'!$B:$M,10,0),VLOOKUP(C34,'[1]Din Rep'!$C:$M,9,0)),\"\")","v":2.5882352941176472},{"$f":"IFERROR(IFERROR(VLOOKUP(B34,'[1]Din Rep'!$B:$M,11,0),VLOOKUP(C34,'[1]Din Rep'!$C:$M,10,0)),\"\")","v":0},{"$f":"IFERROR(IFERROR(VLOOKUP(B34,'[1]Din Rep'!$B:$M,12,0),VLOOKUP(C34,'[1]Din Rep'!$C:$M,11,0)),\"\")","v":"ESTOQUE"}]
[null,"UV041I00DAM2E",{"$f":"IFERROR(VLOOKUP(B35,'[1]Din Rep'!$B:$M,2,0),\"\")","v":" CAMISETA MANGA CURTA INFANTIL DRY ACTION 2E UV MORMAII"},{"$f":"IFERROR(IFERROR(VLOOKUP(B35,'[1]Din Rep'!$B:$M,5,0),VLOOKUP(C35,'[1]Din Rep'!$C:$M,4,0)),\"\")","v":29.019679999999997},{"$f":"IFERROR(IFERROR(VLOOKUP(B35,'[1]Din Rep'!$B:$M,7,0),VLOOKUP(C35,'[1]Din Rep'!$C:$M,6,0)),\"\")","v":30.872},{"$f":"IFERROR(IFERROR(VLOOKUP(B35,'[1]Din Rep'!$B:$M,8,0),VLOOKUP(C35,'[1]Din Rep'!$C:$M,7,0)),\"\")","v":79.904000000000011},{"$f":"IFERROR(IFERROR(VLOOKUP(B35,'[1]Din Rep'!$B:$M,10,0),VLOOKUP(C35,'[1]Din Rep'!$C:$M,9,0)),\"\")","v":2.5882352941176472},{"$f":"IFERROR(IFERROR(VLOOKUP(B35,'[1]Din Rep'!$B:$M,11,0),VLOOKUP(C35,'[1]Din Rep'!$C:$M,10,0)),\"\")","v":0},{"$f":"IFERROR(IFERROR(VLOOKUP(B35,'[1]Din Rep'!$B:$M,12,0),VLOOKUP(C35,'[1]Din Rep'!$C:$M,11,0)),\"\")","v":"ESTOQUE"}]
[null,"UV041I00DCO1A",{"$f":"IFERROR(VLOOKUP(B36,'[1]Din Rep'!$B:$M,2,0),\"\")","v":" CAMISETA MANGA CURTA INFANTIL DRY CONFORT 1A UV MORMAII"},{"$f":"IFERROR(IFERROR(VLOOKUP(B36,'[1]Din Rep'!$B:$M,5,0),VLOOKUP(C36,'[1]Din Rep'!$C:$M,4,0)),\"\")","v":39.910049999999998},{"$f":"IFERROR(IFERROR(VLOOKUP(B36,'[1]Din Rep'!$B:$M,7,0),VLOOKUP(C36,'[1]Din Rep'!$C:$M,6,0)),\"\")","v":42.457500000000003},{"$f":"IFERROR(IFERROR(VLOOKUP(B36,'[1]Din Rep'!$B:$M,8,0),VLOOKUP(C36,'[1]Din Rep'!$C:$M,7,0)),\"\")","v":109.89000000000001},{"$f":"IFERROR(IFERROR(VLOOKUP(B36,'[1]Din Rep'!$B:$M,10,0),VLOOKUP(C36,'[1]Din Rep'!$C:$M,9,0)),\"\")","v":2.5882352941176472},{"$f":"IFERROR(IFERROR(VLOOKUP(B36,'[1]Din Rep'!$B:$M,11,0),VLOOKUP(C36,'[1]Din Rep'!$C:$M,10,0)),\"\")","v":0},{"$f":"IFERROR(IFERROR(VLOOKUP(B36,'[1]Din Rep'!$B:$M,12,0),VLOOKUP(C36,'[1]Din Rep'!$C:$M,11,0)),\"\")","v":"ESTOQUE"}]
[null,"UV041I00DFX2A",{"$f":"IFERROR(VLOOKUP(B37,'[1]Din Rep'!$B:$M,2,0),\"\")","v":" CAMISETA MANGA CURTA INFANTIL DRY FLEX 2A UV MORMAII"},{"$f":"IFERROR(IFERROR(VLOOKUP(B37,'[1]Din Rep'!$B:$M,5,0),VLOOKUP(C37,'[1]Din Rep'!$C:$M,4,0)),\"\")","v":50.808410000000002},{"$f":"IFERROR(IFERROR(VLOOKUP(B37,'[1]Din Rep'!$B:$M,7,0),VLOOKUP(C37,'[1]Din Rep'!$C:$M,6,0)),\"\")","v":54.051500000000004},{"$f":"IFERROR(IFERROR(VLOOKUP(B37,'[1]Din Rep'!$B:$M,8,0),VLOOKUP(C37,'[1]Din Rep'!$C:$M,7,0)),\"\")","v":139.89800000000002},{"$f":"IFERROR(IFERROR(VLOOKUP(B37,'[1]Din Rep'!$B:$M,10,0),VLOOKUP(C37,'[1]Din Rep'!$C:$M,9,0)),\"\")","v":2.5882352941176472},{"$f":"IFERROR(IFERROR(VLOOKUP(B37,'[1]Din Rep'!$B:$M,11,0),VLOOKUP(C37,'[1]Din Rep'!$C:$M,10,0)),\"\")","v":0},{"$f":"IFERROR(IFERROR(VLOOKUP(B37,'[1]Din Rep'!$B:$M,12,0),VLOOKUP(C37,'[1]Din Rep'!$C:$M,11,0)),\"\")","v":"ESTOQUE"}]
["4 - INFANTIL FEMININO","UV037I00DAM2C",{"$f":"IFERROR(VLOOKUP(B38,'[1]Din Rep'!$B:$M,2,0),\"\")","v":" CAMISETA MANGA LONGA INFANTIL DRY ACTION 2C UV MORMAII"},{"$f":"IFERROR(IFERROR(VLOOKUP(B38,'[1]Din Rep'!$B:$M,5,0),VLOOKUP(C38,'[1]Din Rep'!$C:$M,4,0)),\"\")","v":32.64714},{"$f":"IFERROR(IFERROR(VLOOKUP(B38,'[1]Din Rep'!$B:$M,7,0),VLOOKUP(C38,'[1]Din Rep'!$C:$M,6,0)),\"\")","v":34.731000000000002},{"$f":"IFERROR(IFERROR(VLOOKUP(B38,'[1]Din Rep'!$B:$M,8,0),VLOOKUP(C38,'[1]Din Rep'!$C:$M,7,0)),\"\")","v":89.89200000000001},{"$f":"IFERROR(IFERROR(VLOOKUP(B38,'[1]Din Rep'!$B:$M,10,0),VLOOKUP(C38,'[1]Din Rep'!$C:$M,9,0)),\"\")","v":2.5882352941176472},{"$f":"IFERROR(IFERROR(VLOOKUP(B38,'[1]Din Rep'!$B:$M,11,0),VLOOKUP(C38,'[1]Din Rep'!$C:$M,10,0)),\"\")","v":0},{"$f":"IFERROR(IFERROR(VLOOKUP(B38,'[1]Din Rep'!$B:$M,12,0),VLOOKUP(C38,'[1]Din Rep'!$C:$M,11,0)),\"\")","v":"ESTOQUE"}]
[null,"UV037I00DFX2B",{"$f":"IFERROR(VLOOKUP(B39,'[1]Din Rep'!$B:$M,2,0),\"\")","v":" CAMISETA MANGA LONGA INFANTIL DRY FLEX 2B UV MORMAII"},{"$f":"IFERROR(IFERROR(VLOOKUP(B39,'[1]Din Rep'!$B:$M,5,0),VLOOKUP(C39,'[1]Din Rep'!$C:$M,4,0)),\"\")","v":54.443859999999994},{"$f":"IFERROR(IFERROR(VLOOKUP(B39,'[1]Din Rep'!$B:$M,7,0),VLOOKUP(C39,'[1]Din Rep'!$C:$M,6,0)),\"\")","v":57.918999999999997},{"$f":"IFERROR(IFERROR(VLOOKUP(B39,'[1]Din Rep'!$B:$M,8,0),VLOOKUP(C39,'[1]Din Rep'!$C:$M,7,0)),\"\")","v":149.90800000000002},{"$f":"IFERROR(IFERROR(VLOOKUP(B39,'[1]Din Rep'!$B:$M,10,0),VLOOKUP(C39,'[1]Din Rep'!$C:$M,9,0)),\"\")","v":2.5882352941176476},{"$f":"IFERROR(IFERROR(VLOOKUP(B39,'[1]Din Rep'!$B:$M,11,0),VLOOKUP(C39,'[1]Din Rep'!$C:$M,10,0)),\"\")","v":0},{"$f":"IFERROR(IFERROR(VLOOKUP(B39,'[1]Din Rep'!$B:$M,12,0),VLOOKUP(C39,'[1]Din Rep'!$C:$M,11,0)),\"\")","v":"ESTOQUE"}]
[null,"UV041I00DAM2C",{"$f":"IFERROR(VLOOKUP(B40,'[1]Din Rep'!$B:$M,2,0),\"\")","v":" CAMISETA MANGA CURTA INFANTIL DRY ACTION 2C UV MORMAII"},{"$f":"IFERROR(IFERROR(VLOOKUP(B40,'[1]Din Rep'!$B:$M,5,0),VLOOKUP(C40,'[1]Din Rep'!$C:$M,4,0)),\"\")","v":29.019679999999997},{"$f":"IFERROR(IFERROR(VLOOKUP(B40,'[1]Din Rep'!$B:$M,7,0),VLOOKUP(C40,'[1]Din Rep'!$C:$M,6,0)),\"\")","v":30.872},{"$f":"IFERROR(IFERROR(VLOOKUP(B40,'[1]Din Rep'!$B:$M,8,0),VLOOKUP(C40,'[1]Din Rep'!$C:$M,7,0)),\"\")","v":79.904000000000011},{"$f":"IFERROR(IFERROR(VLOOKUP(B40,'[1]Din Rep'!$B:$M,10,0),VLOOKUP(C40,'[1]Din Rep'!$C:$M,9,0)),\"\")","v":2.5882352941176472},{"$f":"IFERROR(IFERROR(VLOOKUP(B40,'[1]Din Rep'!$B:$M,11,0),VLOOKUP(C40,'[1]Din Rep'!$C:$M,10,0)),\"\")","v":0},{"$f":"IFERROR(IFERROR(VLOOKUP(B40,'[1]Din Rep'!$B:$M,12,0),VLOOKUP(C40,'[1]Din Rep'!$C:$M,11,0)),\"\")","v":"ESTOQUE"}]

{"sheet":"UV 19_20","index":3,"n_rows":45,"n_cols":9,"rows_kept":45,"cut":false,"hidden":false,"merged":[[6,0,18,0],[19,0,24,0],[25,0,30,0],[31,0,36,0],[37,0,44,0]]}
[]
[]
[]
[]
[]
["LINHA","REFERENCIA","DESCRIÇÃO","À VISTA","À PRAZO","SUGESTÃO","MARK UP","IPI","ENTREGA"]
["1 - UV MASCULINO","UV038M00DSM1A",{"$f":"IFERROR(VLOOKUP(B7,'[1]Din Rep'!$B:$M,2,0),\"\")","v":"CAMISETA MANGA LONGA C/ CAPUZ MASCULINO DRY SMART 1A UV MORMAII"},{"$f":"IFERROR(IFERROR(VLOOKUP(B7,'[1]Din Rep'!$B:$M,5,0),VLOOKUP(C7,'[1]Din Rep'!$C:$M,4,0)),\"\")","v":61.706769999999992},{"$f":"IFERROR(IFERROR(VLOOKUP(B7,'[1]Din Rep'!$B:$M,7,0),VLOOKUP(C7,'[1]Din Rep'!$C:$M,6,0)),\"\")","v":65.645499999999998},{"$f":"IFERROR(IFERROR(VLOOKUP(B7,'[1]Din Rep'!$B:$M,8,0),VLOOKUP(C7,'[1]Din Rep'!$C:$M,7,0)),\"\")","v":169.9},{"$f":"IFERROR(IFERROR(VLOOKUP(B7,'[1]Din Rep'!$B:$M,10,0),VLOOKUP(C7,'[1]Din Rep'!$C:$M,9,0)),\"\")","v":2.5881438940978438},{"$f":"IFERROR(IFERROR(VLOOKUP(B7,'[1]Din Rep'!$B:$M,11,0),VLOOKUP(C7,'[1]Din Rep'!$C:$M,10,0)),\"\")","v":0},{"$f":"IFERROR(IFERROR(VLOOKUP(B7,'[1]Din Rep'!$B:$M,12,0),VLOOKUP(C7,'[1]Din Rep'!$C:$M,11,0)),\"\")","v":"ESTOQUE"}]
[null,"UV037M00DFX3A",{"$f":"IFERROR(VLOOKUP(B8,'[1]Din Rep'!$B:$M,2,0),\"\")","v":"CAMISETA MANGA LONGA MASCULINO DRY FLEX 3A UV MORMAII"},{"$f":"IFERROR(IFERROR(VLOOKUP(B8,'[1]Din Rep'!$B:$M,5,0),VLOOKUP(C8,'[1]Din Rep'!$C:$M,4,0)),\"\")","v":58.07132},{"$f":"IFERROR(IFERROR(VLOOKUP(B8,'[1]Din Rep'!$B:$M,7,0),VLOOKUP(C8,'[1]Din Rep'!$C:$M,6,0)),\"\")","v":61.778000000000006},{"$f":"IFERROR(IFERROR(VLOOKUP(B8,'[1]Din Rep'!$B:$M,8,0),VLOOKUP(C8,'[1]Din Rep'!$C:$M,7,0)),\"\")","v":159.9},{"$f":"IFERROR(IFERROR(VLOOKUP(B8,'[1]Din Rep'!$B:$M,10,0),VLOOKUP(C8,'[1]Din Rep'!$C:$M,9,0)),\"\")","v":2.5883000420861793},{"$f":"IFERROR(IFERROR(VLOOKUP(B8,'[1]Din Rep'!$B:$M,11,0),VLOOKUP(C8,'[1]Din Rep'!$C:$M,10,0)),\"\")","v":0},{"$f":"IFERROR(IFERROR(VLOOKUP(B8,'[1]Din Rep'!$B:$M,12,0),VLOOKUP(C8,'[1]Din Rep'!$C:$M,11,0)),\"\")","v":"ESTOQUE"}]
[null,"UV041M00DFX3A",{"$f":"IFERROR(VLOOKUP(B9,'[1]Din Rep'!$B:$M,2,0),\"\")","v":"CAMISETA MANGA CURTA MASCULINO DRY FLEX 3A UV MORMAII - SILVEIRA"},{"$f":"IFERROR(IFERROR(VLOOKUP(B9,'[1]Din Rep'!$B:$M,5,0),VLOOKUP(C9,'[1]Din Rep'!$C:$M,4,0)),\"\")","v":54.443859999999994},{"$f":"IFERROR(IFERROR(VLOOKUP(B9,'[1]Din Rep'!$B:$M,7,0),VLOOKUP(C9,'[1]Din Rep'!$C:$M,6,0)),\"\")","v":57.918999999999997},{"$f":"IFERROR(IFERROR(VLOOKUP(B9,'[1]Din Rep'!$B:$M,8,0),VLOOKUP(C9,'[1]Din Rep'!$C:$M,7,0)),\"\")","v":149.9},{"$f":"IFERROR(IFERROR(VLOOKUP(B9,'[1]Din Rep'!$B:$M,10,0),VLOOKUP(C9,'[1]Din Rep'!$C:$M,9,0)),\"\")","v":2.5880971701859496},{"$f":"IFERROR(IFERROR(VLOOKUP(B9,'[1]Din Rep'!$B:$M,11,0),VLOOKUP(C9,'[1]Din Rep'!$C:$M,10,0)),\"\")","v":0},{"$f":"IFERROR(IFERROR(VLOOKUP(B9,'[1]Din Rep'!$B:$M,12,0),VLOOKUP(C9,'[1]Din Rep'!$C:$M,11,0)),\"\")","v":"ESTOQUE"}]
[null,"UV041M00DFX3B",{"$f":"IFERROR(VLOOKUP(B10,'[1]Din Rep'!$B:$M,2,0),\"\")","v":"CAMISETA MANGA CURTA MASCULINO DRY FLEX 3A UV MORMAII - CACIMBA DO PADRE"},{"$f":"IFERROR(IFERROR(VLOOKUP(B10,'[1]Din Rep'!$B:$M,5,0),VLOOKUP(C10,'[1]Din Rep'!$C:$M,4,0)),\"\")","v":54.443859999999994},{"$f":"IFERROR(IFERROR(VLOOKUP(B10,'[1]Din Rep'!$B:$M,7,0),VLOOKUP(C10,'[1]Din Rep'!$C:$M,6,0)),\"\")","v":57.918999999999997},{"$f":"IFERROR(IFERROR(VLOOKUP(B10,'[1]Din Rep'!$B:$M,8,0),VLOOKUP(C10,'[1]Din Rep'!$C:$M,7,0)),\"\")","v":149.9},{"$f":"IFERROR(IFERROR(VLOOKUP(B10,'[1]Din Rep'!$B:$M,10,0),VLOOKUP(C10,'[1]Din Rep'!$C:$M,9,0)),\"\")","v":2.5880971701859496},{"$f":"IFERROR(IFERROR(VLOOKUP(B10,'[1]Din Rep'!$B:$M,11,0),VLOOKUP(C10,'[1]Din Rep'!$C:$M,10,0)),\"\")","v":0},{"$f":"IFERROR(IFERROR(VLOOKUP(B10,'[1]Din Rep'!$B:$M,12,0),VLOOKUP(C10,'[1]Din Rep'!$C:$M,11,0)),\"\")","v":"ESTOQUE"}]
[null,"UV041M00DFX3C",{"$f":"IFERROR(VLOOKUP(B11,'[1]Din Rep'!$B:$M,2,0),\"\")","v":"CAMISETA MANGA CURTA MASCULINO DRY FLEX 3A UV MORMAII - PRAIA DO FORTE"},{"$f":"IFERROR(IFERROR(VLOOKUP(B11,'[1]Din Rep'!$B:$M,5,0),VLOOKUP(C11,'[1]Din Rep'!$C:$M,4,0)),\"\")","v":54.443859999999994},{"$f":"IFERROR(IFERROR(VLOOKUP(B11,'[1]Din Rep'!$B:$M,7,0),VLOOKUP(C11,'[1]Din Rep'!$C:$M,6,0)),\"\")","v":57.918999999999997},{"$f":"IFERROR(IFERROR(VLOOKUP(B11,'[1]Din Rep'!$B:$M,8,0),VLOOKUP(C11,'[1]Din Rep'!$C:$M,7,0)),\"\")","v":149.9},{"$f":"IFERROR(IFERROR(VLOOKUP(B11,'[1]Din Rep'!$B:$M,10,0),VLOOKUP(C11,'[1]Din Rep'!$C:$M,9,0)),\"\")","v":2.5880971701859496},{"$f":"IFERROR(IFERROR(VLOOKUP(B11,'[1]Din Rep'!$B:$M,11,0),VLOOKUP(C11,'[1]Din Rep'!$C:$M,10,0)),\"\")","v":0},{"$f":"IFERROR(IFERROR(VLOOKUP(B11,'[1]Din Rep'!$B:$M,12,0),VLOOKUP(C11,'[1]Din Rep'!$C:$M,11,0)),\"\")","v":"ESTOQUE"}]
[null,"UV038M00DCO2A",{"$f":"IFERROR(VLOOKUP(B12,'[1]Din Rep'!$B:$M,2,0),\"\")","v":"CAMISETA MANGA LONGA C/ CAPUZ MASCULINO DRY COMFORT 2A UV MORMAII"},{"$f":"IFERROR(IFERROR(VLOOKUP(B12,'[1]Din Rep'!$B:$M,5,0),VLOOKUP(C12,'[1]Din Rep'!$C:$M,4,0)),\"\")","v":54.443859999999994},{"$f":"IFERROR(IFERROR(VLOOKUP(B12,'[1]Din Rep'!$B:$M,7,0),VLOOKUP(C12,'[1]Din Rep'!$C:$M,6,0)),\"\")","v":57.918999999999997},{"$f":"IFERROR(IFERROR(VLOOKUP(B12,'[1]Din Rep'!$B:$M,8,0),VLOOKUP(C12,'[1]Din Rep'!$C:$M,7,0)),\"\")","v":149.9},{"$f":"IFERROR(IFERROR(VLOOKUP(B12,'[1]Din Rep'!$B:$M,10,0),VLOOKUP(C12,'[1]Din Rep'!$C:$M,9,0)),\"\")","v":2.5880971701859496},{"$f":"IFERROR(IFERROR(VLOOKUP(B12,'[1]Din Rep'!$B:$M,11,0),VLOOKUP(C12,'[1]Din Rep'!$C:$M,10,0)),\"\")","v":0},{"$f":"IFERROR(IFERROR(VLOOKUP(B12,'[1]Din Rep'!$B:$M,12,0),VLOOKUP(C12,'[1]Din Rep'!$C:$M,11,0)),\"\")","v":"ESTOQUE"}]
[null,"UV037M00DCO2A",{"$f":"IFERROR(VLOOKUP(B13,'[1]Din Rep'!$B:$M,2,0),\"\")","v":"CAMISETA MANGA LONGA MASCULINO DRY COMFORT 2A UV MORMAII"},{"$f":"IFERROR(IFERROR(VLOOKUP(B13,'[1]Din Rep'!$B:$M,5,0),VLOOKUP(C13,'[1]Din Rep'!$C:$M,4,0)),\"\")","v":50.808410000000002},{"$f":"IFERROR(IFERROR(VLOOKUP(B13,'[1]Din Rep'!$B:$M,7,0),VLOOKUP(C13,'[1]Din Rep'!$C:$M,6,0)),\"\")","v":54.051500000000004},{"$f":"IFERROR(IFERROR(VLOOKUP(B13,'[1]Din Rep'!$B:$M,8,0),VLOOKUP(C13,'[1]Din Rep'!$C:$M,7,0)),\"\")","v":139.9},{"$f":"IFERROR(IFERROR(VLOOKUP(B13,'[1]Din Rep'!$B:$M,10,0),VLOOKUP(C13,'[1]Din Rep'!$C:$M,9,0)),\"\")","v":2.5882722958659796},{"$f":"IFERROR(IFERROR(VLOOKUP(B13,'[1]Din Rep'!$B:$M,11,0),VLOOKUP(C13,'[1]Din Rep'!$C:$M,10,0)),\"\")","v":0},{"$f":"IFERROR(IFERROR(VLOOKUP(B13,'[1]Din Rep'!$B:$M,12,0),VLOOKUP(C13,'[1]Din Rep'!$C:$M,11,0)),\"\")","v":"ESTOQUE"}]
[null,"UV041M00DCO2A",{"$f":"IFERROR(VLOOKUP(B14,'[1]Din Rep'!$B:$M,2,0),\"\")","v":"CAMISETA MANGA CURTA MASCULINO DRY COMFORT 2A UV MORMAII"},{"$f":"IFERROR(IFERROR(VLOOKUP(B14,'[1]Din Rep'!$B:$M,5,0),VLOOKUP(C14,'[1]Din Rep'!$C:$M,4,0)),\"\")","v":47.180949999999996},{"$f":"IFERROR(IFERROR(VLOOKUP(B14,'[1]Din Rep'!$B:$M,7,0),VLOOKUP(C14,'[1]Din Rep'!$C:$M,6,0)),\"\")","v":50.192499999999995},{"$f":"IFERROR(IFERROR(VLOOKUP(B14,'[1]Din Rep'!$B:$M,8,0),VLOOKUP(C14,'[1]Din Rep'!$C:$M,7,0)),\"\")","v":129.9},{"$f":"IFERROR(IFERROR(VLOOKUP(B14,'[1]Din Rep'!$B:$M,10,0),VLOOKUP(C14,'[1]Din Rep'!$C:$M,9,0)),\"\")","v":2.5880360611645168},{"$f":"IFERROR(IFERROR(VLOOKUP(B14,'[1]Din Rep'!$B:$M,11,0),VLOOKUP(C14,'[1]Din Rep'!$C:$M,10,0)),\"\")","v":0},{"$f":"IFERROR(IFERROR(VLOOKUP(B14,'[1]Din Rep'!$B:$M,12,0),VLOOKUP(C14,'[1]Din Rep'!$C:$M,11,0)),\"\")","v":"ESTOQUE"}]
[null,"UV037M00DMO1A",{"$f":"IFERROR(VLOOKUP(B15,'[1]Din Rep'!$B:$M,2,0),\"\")","v":"CAMISETA MANGA LONGA MASCULINO DRY MOVE 1A UV MORMAII"},{"$f":"IFERROR(IFERROR(VLOOKUP(B15,'[1]Din Rep'!$B:$M,5,0),VLOOKUP(C15,'[1]Din Rep'!$C:$M,4,0)),\"\")","v":58.07132},{"$f":"IFERROR(IFERROR(VLOOKUP(B15,'[1]Din Rep'!$B:$M,7,0),VLOOKUP(C15,'[1]Din Rep'!$C:$M,6,0)),\"\")","v":61.778000000000006},{"$f":"IFERROR(IFERROR(VLOOKUP(B15,'[1]Din Rep'!$B:$M,8,0),VLOOKUP(C15,'[1]Din Rep'!$C:$M,7,0)),\"\")","v":159.9},{"$f":"IFERROR(IFERROR(VLOOKUP(B15,'[1]Din Rep'!$B:$M,10,0),VLOOKUP(C15,'[1]Din Rep'!$C:$M,9,0)),\"\")","v":2.5883000420861793},{"$f":"IFERROR(IFERROR(VLOOKUP(B15,'[1]Din Rep'!$B:$M,11,0),VLOOKUP(C15,'[1]Din Rep'!$C:$M,10,0)),\"\")","v":0},{"$f":"IFERROR(IFERROR(VLOOKUP(B15,'[1]Din Rep'!$B:$M,12,0),VLOOKUP(C15,'[1]Din Rep'!$C:$M,11,0)),\"\")","v":"ESTOQUE"}]
[null,"UV041M00DMO1A",{"$f":"IFERROR(VLOOKUP(B16,'[1]Din Rep'!$B:$M,2,0),\"\")","v":"CAMISETA MANGA CURTA MASCULINO DRY MOVE 1A UV MORMAII"},{"$f":"IFERROR(IFERROR(VLOOKUP(B16,'[1]Din Rep'!$B:$M,5,0),VLOOKUP(C16,'[1]Din Rep'!$C:$M,4,0)),\"\")","v":50.808410000000002},{"$f":"IFERROR(IFERROR(VLOOKUP(B16,'[1]Din Rep'!$B:$M,7,0),VLOOKUP(C16,'[1]Din Rep'!$C:$M,6,0)),\"\")","v":54.051500000000004},{"$f":"IFERROR(IFERROR(VLOOKUP(B16,'[1]Din Rep'!$B:$M,8,0),VLOOKUP(C16,'[1]Din Rep'!$C:$M,7,0)),\"\")","v":139.9},{"$f":"IFERROR(IFERROR(VLOOKUP(B16,'[1]Din Rep'!$B:$M,10,0),VLOOKUP(C16,'[1]Din Rep'!$C:$M,9,0)),\"\")","v":2.5882722958659796},{"$f":"IFERROR(IFERROR(VLOOKUP(B16,'[1]Din Rep'!$B:$M,11,0),VLOOKUP(C16,'[1]Din Rep'!$C:$M,10,0)),\"\")","v":0},{"$f":"IFERROR(IFERROR(VLOOKUP(B16,'[1]Din Rep'!$B:$M,12,0),VLOOKUP(C16,'[1]Din Rep'!$C:$M,11,0)),\"\")","v":"ESTOQUE"}]
[null,"UV037M00DSM1B",{"$f":"IFERROR(VLOOKUP(B17,'[1]Din Rep'!$B:$M,2,0),\"\")","v":"CAMISETA MANGA LONGA MASCULINO DRY SMART 1B UV MORMAII"},{"$f":"IFERROR(IFERROR(VLOOKUP(B17,'[1]Din Rep'!$B:$M,5,0),VLOOKUP(C17,'[1]Din Rep'!$C:$M,4,0)),\"\")","v":36.282589999999992},{"$f":"IFERROR(IFERROR(VLOOKUP(B17,'[1]Din Rep'!$B:$M,7,0),VLOOKUP(C17,'[1]Din Rep'!$C:$M,6,0)),\"\")","v":38.598499999999994},{"$f":"IFERROR(IFERROR(VLOOKUP(B17,'[1]Din Rep'!$B:$M,8,0),VLOOKUP(C17,'[1]Din Rep'!$C:$M,7,0)),\"\")","v":99.9},{"$f":"IFERROR(IFERROR(VLOOKUP(B17,'[1]Din Rep'!$B:$M,10,0),VLOOKUP(C17,'[1]Din Rep'!$C:$M,9,0)),\"\")","v":2.5881834786325899},{"$f":"IFERROR(IFERROR(VLOOKUP(B17,'[1]Din Rep'!$B:$M,11,0),VLOOKUP(C17,'[1]Din Rep'!$C:$M,10,0)),\"\")","v":0},{"$f":"IFERROR(IFERROR(VLOOKUP(B17,'[1]Din Rep'!$B:$M,12,0),VLOOKUP(C17,'[1]Din Rep'!$C:$M,11,0)),\"\")","v":"ESTOQUE"}]
[null,"UV037M00DAM3A",{"$f":"IFERROR(VLOOKUP(B18,'[1]Din Rep'!$B:$M,2,0),\"\")","v":"CAMISETA MANGA LONGA MASCULINO DRY ACTION 3A UV MORMAII"},{"$f":"IFERROR(IFERROR(VLOOKUP(B18,'[1]Din Rep'!$B:$M,5,0),VLOOKUP(C18,'[1]Din Rep'!$C:$M,4,0)),\"\")","v":32.64714},{"$f":"IFERROR(IFERROR(VLOOKUP(B18,'[1]Din Rep'!$B:$M,7,0),VLOOKUP(C18,'[1]Din Rep'!$C:$M,6,0)),\"\")","v":34.731000000000002},{"$f":"IFERROR(IFERROR(VLOOKUP(B18,'[1]Din Rep'!$B:$M,8,0),VLOOKUP(C18,'[1]Din Rep'!$C:$M,7,0)),\"\")","v":89.9},{"$f":"IFERROR(IFERROR(VLOOKUP(B18,'[1]Din Rep'!$B:$M,10,0),VLOOKUP(C18,'[1]Din Rep'!$C:$M,9,0)),\"\")","v":2.5884656358872475},{"$f":"IFERROR(IFERROR(VLOOKUP(B18,'[1]Din Rep'!$B:$M,11,0),VLOOKUP(C18,'[1]Din Rep'!$C:$M,10,0)),\"\")","v":0},{"$f":"IFERROR(IFERROR(VLOOKUP(B18,'[1]Din Rep'!$B:$M,12,0),VLOOKUP(C18,'[1]Din Rep'!$C:$M,11,0)),\"\")","v":"ESTOQUE"}]
[null,"UV041M00DAM3A",{"$f":"IFERROR(VLOOKUP(B19,'[1]Din Rep'!$B:$M,2,0),\"\")","v":"CAMISETA MANGA CURTA MASCULINO DRY ACTION 3A UV MORMAII"},{"$f":"IFERROR(IFERROR(VLOOKUP(B19,'[1]Din Rep'!$B:$M,5,0),VLOOKUP(C19,'[1]Din Rep'!$C:$M,4,0)),\"\")","v":29.019679999999997},{"$f":"IFERROR(IFERROR(VLOOKUP(B19,'[1]Din Rep'!$B:$M,7,0),VLOOKUP(C19,'[1]Din Rep'!$C:$M,6,0)),\"\")","v":30.872},{"$f":"IFERROR(IFERROR(VLOOKUP(B19,'[1]Din Rep'!$B:$M,8,0),VLOOKUP(C19,'[1]Din Rep'!$C:$M,7,0)),\"\")","v":79.900000000000006},{"$f":"IFERROR(IFERROR(VLOOKUP(B19,'[1]Din Rep'!$B:$M,10,0),VLOOKUP(C19,'[1]Din Rep'!$C:$M,9,0)),\"\")","v":2.5881057268722469},{"$f":"IFERROR(IFERROR(VLOOKUP(B19,'[1]Din Rep'!$B:$M,11,0),VLOOKUP(C19,'[1]Din Rep'!$C:$M,10,0)),\"\")","v":0},{"$f":"IFERROR(IFERROR(VLOOKUP(B19,'[1]Din Rep'!$B:$M,12,0),VLOOKUP(C19,'[1]Din Rep'!$C:$M,11,0)),\"\")","v":"ESTOQUE"}]
["2 - UV FEMININO","UV037F00DMO1A",{"$f":"IFERROR(VLOOKUP(B20,'[1]Din Rep'!$B:$M,2,0),\"\")","v":"CAMISETA MANGA LONGA FEMININO DRY MOVE 1A UV MORMAII"},{"$f":"IFERROR(IFERROR(VLOOKUP(B20,'[1]Din Rep'!$B:$M,5,0),VLOOKUP(C20,'[1]Din Rep'!$C:$M,4,0)),\"\")","v":47.180949999999996},{"$f":"IFERROR(IFERROR(VLOOKUP(B20,'[1]Din Rep'!$B:$M,7,0),VLOOKUP(C20,'[1]Din Rep'!$C:$M,6,0)),\"\")","v":50.192499999999995},{"$f":"IFERROR(IFERROR(VLOOKUP(B20,'[1]Din Rep'!$B:$M,8,0),VLOOKUP(C20,'[1]Din Rep'!$C:$M,7,0)),\"\")","v":129.9},{"$f":"IFERROR(IFERROR(VLOOKUP(B20,'[1]Din Rep'!$B:$M,10,0),VLOOKUP(C20,'[1]Din Rep'!$C:$M,9,0)),\"\")","v":2.5880360611645168},{"$f":"IFERROR(IFERROR(VLOOKUP(B20,'[1]Din Rep'!$B:$M,11,0),VLOOKUP(C20,'[1]Din Rep'!$C:$M,10,0)),\"\")","v":0},{"$f":"IFERROR(IFERROR(VLOOKUP(B20,'[1]Din Rep'!$B:$M,12,0),VLOOKUP(C20,'[1]Din Rep'!$C:$M,11,0)),\"\")","v":"ESTOQUE"}]
[null,"UV041F00DMO1A",{"$f":"IFERROR(VLOOKUP(B21,'[1]Din Rep'!$B:$M,2,0),\"\")","v":"CAMISETA MANGA CURTA FEMININO DRY MOVE 1A UV MORMAII"},{"$f":"IFERROR(IFERROR(VLOOKUP(B21,'[1]Din Rep'!$B:$M,5,0),VLOOKUP(C21,'[1]Din Rep'!$C:$M,4,0)),\"\")","v":43.545499999999997},{"$f":"IFERROR(IFERROR(VLOOKUP(B21,'[1]Din Rep'!$B:$M,7,0),VLOOKUP(C21,'[1]Din Rep'!$C:$M,6,0)),\"\")","v":46.324999999999996},{"$f":"IFERROR(IFERROR(VLOOKUP(B21,'[1]Din Rep'!$B:$M,8,0),VLOOKUP(C21,'[1]Din Rep'!$C:$M,7,0)),\"\")","v":119.9},{"$f":"IFERROR(IFERROR(VLOOKUP(B21,'[1]Din Rep'!$B:$M,10,0),VLOOKUP(C21,'[1]Din Rep'!$C:$M,9,0)),\"\")","v":2.5882352941176476},{"$f":"IFERROR(IFERROR(VLOOKUP(B21,'[1]Din Rep'!$B:$M,11,0),VLOOKUP(C21,'[1]Din Rep'!$C:$M,10,0)),\"\")","v":0},{"$f":"IFERROR(IFERROR(VLOOKUP(B21,'[1]Din Rep'!$B:$M,12,0),VLOOKUP(C21,'[1]Din Rep'!$C:$M,11,0)),\"\")","v":"ESTOQUE"}]
[null,"UV037F00DSM1A",{"$f":"IFERROR(VLOOKUP(B22,'[1]Din Rep'!$B:$M,2,0),\"\")","v":"CAMISETA MANGA LONGA FEMININO DRY SMART 1A UV MORMAII"},{"$f":"IFERROR(IFERROR(VLOOKUP(B22,'[1]Din Rep'!$B:$M,5,0),VLOOKUP(C22,'[1]Din Rep'!$C:$M,4,0)),\"\")","v":36.282589999999992},{"$f":"IFERROR(IFERROR(VLOOKUP(B22,'[1]Din Rep'!$B:$M,7,0),VLOOKUP(C22,'[1]Din Rep'!$C:$M,6,0)),\"\")","v":38.598499999999994},{"$f":"IFERROR(IFERROR(VLOOKUP(B22,'[1]Din Rep'!$B:$M,8,0),VLOOKUP(C22,'[1]Din Rep'!$C:$M,7,0)),\"\")","v":99.9},{"$f":"IFERROR(IFERROR(VLOOKUP(B22,'[1]Din Rep'!$B:$M,10,0),VLOOKUP(C22,'[1]Din Rep'!$C:$M,9,0)),\"\")","v":2.5881834786325899},{"$f":"IFERROR(IFERROR(VLOOKUP(B22,'[1]Din Rep'!$B:$M,11,0),VLOOKUP(C22,'[1]Din Rep'!$C:$M,10,0)),\"\")","v":0},{"$f":"IFERROR(IFERROR(VLOOKUP(B22,'[1]Din Rep'!$B:$M,12,0),VLOOKUP(C22,'[1]Din Rep'!$C:$M,11,0)),\"\")","v":"ESTOQUE"}]
[null,"UV041F00DSM1A",{"$f":"IFERROR(VLOOKUP(B23,'[1]Din Rep'!$B:$M,2,0),\"\")","v":"CAMISETA MANGA CURTA FEMININO DRY SMART 1A UV MORMAII"},{"$f":"IFERROR(IFERROR(VLOOKUP(B23,'[1]Din Rep'!$B:$M,5,0),VLOOKUP(C23,'[1]Din Rep'!$C:$M,4,0)),\"\")","v":32.64714},{"$f":"IFERROR(IFERROR(VLOOKUP(B23,'[1]Din Rep'!$B:$M,7,0),VLOOKUP(C23,'[1]Din Rep'!$C:$M,6,0)),\"\")","v":34.731000000000002},{"$f":"IFERROR(IFERROR(VLOOKUP(B23,'[1]Din Rep'!$B:$M,8,0),VLOOKUP(C23,'[1]Din Rep'!$C:$M,7,0)),\"\")","v":89.9},{"$f":"IFERROR(IFERROR(VLOOKUP(B23,'[1]Din Rep'!$B:$M,10,0),VLOOKUP(C23,'[1]Din Rep'!$C:$M,9,0)),\"\")","v":2.5884656358872475},{"$f":"IFERROR(IFERROR(VLOOKUP(B23,'[1]Din Rep'!$B:$M,11,0),VLOOKUP(C23,'[1]Din Rep'!$C:$M,10,0)),\"\")","v":0},{"$f":"IFERROR(IFERROR(VLOOKUP(B23,'[1]Din Rep'!$B:$M,12,0),VLOOKUP(C23,'[1]Din Rep'!$C:$M,11,0)),\"\")","v":"ESTOQUE"}]
[null,"UV037F00DAM3A",{"$f":"IFERROR(VLOOKUP(B24,'[1]Din Rep'!$B:$M,2,0),\"\")","v":"CAMISETA MANGA LONGA FEMININO DRY ACTION 3A UV MORMAII"},{"$f":"IFERROR(IFERROR(VLOOKUP(B24,'[1]Din Rep'!$B:$M,5,0),VLOOKUP(C24,'[1]Din Rep'!$C:$M,4,0)),\"\")","v":32.64714},{"$f":"IFERROR(IFERROR(VLOOKUP(B24,'[1]Din Rep'!$B:$M,7,0),VLOOKUP(C24,'[1]Din Rep'!$C:$M,6,0)),\"\")","v":34.731000000000002},{"$f":"IFERROR(IFERROR(VLOOKUP(B24,'[1]Din Rep'!$B:$M,8,0),VLOOKUP(C24,'[1]Din Rep'!$C:$M,7,0)),\"\")","v":89.9},{"$f":"IFERROR(IFERROR(VLOOKUP(B24,'[1]Din Rep'!$B:$M,10,0),VLOOKUP(C24,'[1]Din Rep'!$C:$M,9,0)),\"\")","v":2.5884656358872475},{"$f":"IFERROR(IFERROR(VLOOKUP(B24,'[1]Din Rep'!$B:$M,11,0),VLOOKUP(C24,'[1]Din Rep'!$C:$M,10,0)),\"\")","v":0},{"$f":"IFERROR(IFERROR(VLOOKUP(B24,'[1]Din Rep'!$B:$M,12,0),VLOOKUP(C24,'[1]Din Rep'!$C:$M,11,0)),\"\")","v":"ESTOQUE"}]
[null,"UV041F00DAM3A",{"$f":"IFERROR(VLOOKUP(B25,'[1]Din Rep'!$B:$M,2,0),\"\")","v":"CAMISETA MANGA CURTA FEMININO DRY ACTION 3A UV MORMAII"},{"$f":"IFERROR(IFERROR(VLOOKUP(B25,'[1]Din Rep'!$B:$M,5,0),VLOOKUP(C25,'[1]Din Rep'!$C:$M,4,0)),\"\")","v":29.019679999999997},{"$f":"IFERROR(IFERROR(VLOOKUP(B25,'[1]Din Rep'!$B:$M,7,0),VLOOKUP(C25,'[1]Din Rep'!$C:$M,6,0)),\"\")","v":30.872},{"$f":"IFERROR(IFERROR(VLOOKUP(B25,'[1]Din Rep'!$B:$M,8,0),VLOOKUP(C25,'[1]Din Rep'!$C:$M,7,0)),\"\")","v":79.900000000000006},{"$f":"IFERROR(IFERROR(VLOOKUP(B25,'[1]Din Rep'!$B:$M,10,0),VLOOKUP(C25,'[1]Din Rep'!$C:$M,9,0)),\"\")","v":2.5881057268722469},{"$f":"IFERROR(IFERROR(VLOOKUP(B25,'[1]Din Rep'!$B:$M,11,0),VLOOKUP(C25,'[1]Din Rep'!$C:$M,10,0)),\"\")","v":0},{"$f":"IFERROR(IFERROR(VLOOKUP(B25,'[1]Din Rep'!$B:$M,12,0),VLOOKUP(C25,'[1]Din Rep'!$C:$M,11,0)),\"\")","v":"ESTOQUE"}]
["3 - INFANTIL MASCULINO","UV037I00DSM1D",{"$f":"IFERROR(VLOOKUP(B26,'[1]Din Rep'!$B:$M,2,0),\"\")","v":"CAMISETA MANGA LONGA INFANTIL DRY SMART 1D UV MORMAII"},{"$f":"IFERROR(IFERROR(VLOOKUP(B26,'[1]Din Rep'!$B:$M,5,0),VLOOKUP(C26,'[1]Din Rep'!$C:$M,4,0)),\"\")","v":43.545499999999997},{"$f":"IFERROR(IFERROR(VLOOKUP(B26,'[1]Din Rep'!$B:$M,7,0),VLOOKUP(C26,'[1]Din Rep'!$C:$M,6,0)),\"\")","v":46.324999999999996},{"$f":"IFERROR(IFERROR(VLOOKUP(B26,'[1]Din Rep'!$B:$M,8,0),VLOOKUP(C26,'[1]Din Rep'!$C:$M,7,0)),\"\")","v":119.9},{"$f":"IFERROR(IFERROR(VLOOKUP(B26,'[1]Din Rep'!$B:$M,10,0),VLOOKUP(C26,'[1]Din Rep'!$C:$M,9,0)),\"\")","v":2.5882352941176476},{"$f":"IFERROR(IFERROR(VLOOKUP(B26,'[1]Din Rep'!$B:$M,11,0),VLOOKUP(C26,'[1]Din Rep'!$C:$M,10,0)),\"\")","v":0},{"$f":"IFERROR(IFERROR(VLOOKUP(B26,'[1]Din Rep'!$B:$M,12,0),VLOOKUP(C26,'[1]Din Rep'!$C:$M,11,0)),\"\")","v":"ESTOQUE"}]
[null,"UV037I00DSM1C",{"$f":"IFERROR(VLOOKUP(B27,'[1]Din Rep'!$B:$M,2,0),\"\")","v":"CAMISETA MANGA LONGA INFANTIL DRY SMART 1C  UV MORMAII"},{"$f":"IFERROR(IFERROR(VLOOKUP(B27,'[1]Din Rep'!$B:$M,5,0),VLOOKUP(C27,'[1]Din Rep'!$C:$M,4,0)),\"\")","v":43.545499999999997},{"$f":"IFERROR(IFERROR(VLOOKUP(B27,'[1]Din Rep'!$B:$M,7,0),VLOOKUP(C27,'[1]Din Rep'!$C:$M,6,0)),\"\")","v":46.324999999999996},{"$f":"IFERROR(IFERROR(VLOOKUP(B27,'[1]Din Rep'!$B:$M,8,0),VLOOKUP(C27,'[1]Din Rep'!$C:$M,7,0)),\"\")","v":119.9},{"$f":"IFERROR(IFERROR(VLOOKUP(B27,'[1]Din Rep'!$B:$M,10,0),VLOOKUP(C27,'[1]Din Rep'!$C:$M,9,0)),\"\")","v":2.5882352941176476},{"$f":"IFERROR(IFERROR(VLOOKUP(B27,'[1]Din Rep'!$B:$M,11,0),VLOOKUP(C27,'[1]Din Rep'!$C:$M,10,0)),\"\")","v":0},{"$f":"IFERROR(IFERROR(VLOOKUP(B27,'[1]Din Rep'!$B:$M,12,0),VLOOKUP(C27,'[1]Din Rep'!$C:$M,11,0)),\"\")","v":"ESTOQUE"}]
[null,"UV041I00DSM1C",{"$f":"IFERROR(VLOOKUP(B28,'[1]Din Rep'!$B:$M,2,0),\"\")","v":"CAMISETA MANGA CURTA INFANTIL DRY SMART 1C UV MORMAII"},{"$f":"IFERROR(IFERROR(VLOOKUP(B28,'[1]Din Rep'!$B:$M,5,0),VLOOKUP(C28,'[1]Din Rep'!$C:$M,4,0)),\"\")","v":39.910049999999998},{"$f":"IFERROR(IFERROR(VLOOKUP(B28,'[1]Din Rep'!$B:$M,7,0),VLOOKUP(C28,'[1]Din Rep'!$C:$M,6,0)),\"\")","v":42.457500000000003},{"$f":"IFERROR(IFERROR(VLOOKUP(B28,'[1]Din Rep'!$B:$M,8,0),VLOOKUP(C28,'[1]Din Rep'!$C:$M,7,0)),\"\")","v":109.9},{"$f":"IFERROR(IFERROR(VLOOKUP(B28,'[1]Din Rep'!$B:$M,10,0),VLOOKUP(C28,'[1]Din Rep'!$C:$M,9,0)),\"\")","v":2.5884708237649412},{"$f":"IFERROR(IFERROR(VLOOKUP(B28,'[1]Din Rep'!$B:$M,11,0),VLOOKUP(C28,'[1]Din Rep'!$C:$M,10,0)),\"\")","v":0},{"$f":"IFERROR(IFERROR(VLOOKUP(B28,'[1]Din Rep'!$B:$M,12,0),VLOOKUP(C28,'[1]Din Rep'!$C:$M,11,0)),\"\")","v":"ESTOQUE"}]
[null,"UV041I00DSM1B",{"$f":"IFERROR(VLOOKUP(B29,'[1]Din Rep'!$B:$M,2,0),\"\")","v":"CAMISETA MANGA CURTA INFANTIL DRY SMART 1B UV MORMAII"},{"$f":"IFERROR(IFERROR(VLOOKUP(B29,'[1]Din Rep'!$B:$M,5,0),VLOOKUP(C29,'[1]Din Rep'!$C:$M,4,0)),\"\")","v":39.910049999999998},{"$f":"IFERROR(IFERROR(VLOOKUP(B29,'[1]Din Rep'!$B:$M,7,0),VLOOKUP(C29,'[1]Din Rep'!$C:$M,6,0)),\"\")","v":42.457500000000003},{"$f":"IFERROR(IFERROR(VLOOKUP(B29,'[1]Din Rep'!$B:$M,8,0),VLOOKUP(C29,'[1]Din Rep'!$C:$M,7,0)),\"\")","v":109.9},{"$f":"IFERROR(IFERROR(VLOOKUP(B29,'[1]Din Rep'!$B:$M,10,0),VLOOKUP(C29,'[1]Din Rep'!$C:$M,9,0)),\"\")","v":2.5884708237649412},{"$f":"IFERROR(IFERROR(VLOOKUP(B29,'[1]Din Rep'!$B:$M,11,0),VLOOKUP(C29,'[1]Din Rep'!$C:$M,10,0)),\"\")","v":0},{"$f":"IFERROR(IFERROR(VLOOKUP(B29,'[1]Din Rep'!$B:$M,12,0),VLOOKUP(C29,'[1]Din Rep'!$C:$M,11,0)),\"\")","v":"ESTOQUE"}]
[null,"UV037I00DAM3A",{"$f":"IFERROR(VLOOKUP(B30,'[1]Din Rep'!$B:$M,2,0),\"\")","v":"CAMISETA MANGA LONGA INFANTIL DRY ACTION 3A UV MORMAII"},{"$f":"IFERROR(IFERROR(VLOOKUP(B30,'[1]Din Rep'!$B:$M,5,0),VLOOKUP(C30,'[1]Din Rep'!$C:$M,4,0)),\"\")","v":32.64714},{"$f":"IFERROR(IFERROR(VLOOKUP(B30,'[1]Din Rep'!$B:$M,7,0),VLOOKUP(C30,'[1]Din Rep'!$C:$M,6,0)),\"\")","v":34.731000000000002},{"$f":"IFERROR(IFERROR(VLOOKUP(B30,'[1]Din Rep'!$B:$M,8,0),VLOOKUP(C30,'[1]Din Rep'!$C:$M,7,0)),\"\")","v":89.9},{"$f":"IFERROR(IFERROR(VLOOKUP(B30,'[1]Din Rep'!$B:$M,10,0),VLOOKUP(C30,'[1]Din Rep'!$C:$M,9,0)),\"\")","v":2.5884656358872475},{"$f":"IFERROR(IFERROR(VLOOKUP(B30,'[1]Din Rep'!$B:$M,11,0),VLOOKUP(C30,'[1]Din Rep'!$C:$M,10,0)),\"\")","v":0},{"$f":"IFERROR(IFERROR(VLOOKUP(B30,'[1]Din Rep'!$B:$M,12,0),VLOOKUP(C30,'[1]Din Rep'!$C:$M,11,0)),\"\")","v":"ESTOQUE"}]
[null,"UV041I00DAM3A",{"$f":"IFERROR(VLOOKUP(B31,'[1]Din Rep'!$B:$M,2,0),\"\")","v":"CAMISETA MANGA CURTA INFANTIL DRY ACTION 3A UV MORMAII"},{"$f":"IFERROR(IFERROR(VLOOKUP(B31,'[1]Din Rep'!$B:$M,5,0),VLOOKUP(C31,'[1]Din Rep'!$C:$M,4,0)),\"\")","v":29.019679999999997},{"$f":"IFERROR(IFERROR(VLOOKUP(B31,'[1]Din Rep'!$B:$M,7,0),VLOOKUP(C31,'[1]Din Rep'!$C:$M,6,0)),\"\")","v":30.872},{"$f":"IFERROR(IFERROR(VLOOKUP(B31,'[1]Din Rep'!$B:$M,8,0),VLOOKUP(C31,'[1]Din Rep'!$C:$M,7,0)),\"\")","v":79.900000000000006},{"$f":"IFERROR(IFERROR(VLOOKUP(B31,'[1]Din Rep'!$B:$M,10,0),VLOOKUP(C31,'[1]Din Rep'!$C:$M,9,0)),\"\")","v":2.5881057268722469},{"$f":"IFERROR(IFERROR(VLOOKUP(B31,'[1]Din Rep'!$B:$M,11,0),VLOOKUP(C31,'[1]Din Rep'!$C:$M,10,0)),\"\")","v":0},{"$f":"IFERROR(IFERROR(VLOOKUP(B31,'[1]Din Rep'!$B:$M,12,0),VLOOKUP(C31,'[1]Din Rep'!$C:$M,11,0)),\"\")","v":"ESTOQUE"}]
["4 - INFANTIL FEMININO","UV021I00DSM1A",{"$f":"IFERROR(VLOOKUP(B32,'[1]Din Rep'!$B:$M,2,0),\"\")","v":"BODY MANGA LONGA INFANTIL DRY SMART 1A UV MORMAII"},{"$f":"IFERROR(IFERROR(VLOOKUP(B32,'[1]Din Rep'!$B:$M,5,0),VLOOKUP(C32,'[1]Din Rep'!$C:$M,4,0)),\"\")","v":58.07132},{"$f":"IFERROR(IFERROR(VLOOKUP(B32,'[1]Din Rep'!$B:$M,7,0),VLOOKUP(C32,'[1]Din Rep'!$C:$M,6,0)),\"\")","v":61.778000000000006},{"$f":"IFERROR(IFERROR(VLOOKUP(B32,'[1]Din Rep'!$B:$M,8,0),VLOOKUP(C32,'[1]Din Rep'!$C:$M,7,0)),\"\")","v":159.9},{"$f":"IFERROR(IFERROR(VLOOKUP(B32,'[1]Din Rep'!$B:$M,10,0),VLOOKUP(C32,'[1]Din Rep'!$C:$M,9,0)),\"\")","v":2.5883000420861793},{"$f":"IFERROR(IFERROR(VLOOKUP(B32,'[1]Din Rep'!$B:$M,11,0),VLOOKUP(C32,'[1]Din Rep'!$C:$M,10,0)),\"\")","v":0},{"$f":"IFERROR(IFERROR(VLOOKUP(B32,'[1]Din Rep'!$B:$M,12,0),VLOOKUP(C32,'[1]Din Rep'!$C:$M,11,0)),\"\")","v":"ESTOQUE"}]
[null,"UV037I00DSM1B",{"$f":"IFERROR(VLOOKUP(B33,'[1]Din Rep'!$B:$M,2,0),\"\")","v":"CAMISETA MANGA LONGA INFANTIL DRY SMART 1B UV MORMAII"},{"$f":"IFERROR(IFERROR(VLOOKUP(B33,'[1]Din Rep'!$B:$M,5,0),VLOOKUP(C33,'[1]Din Rep'!$C:$M,4,0)),\"\")","v":43.545499999999997},{"$f":"IFERROR(IFERROR(VLOOKUP(B33,'[1]Din Rep'!$B:$M,7,0),VLOOKUP(C33,'[1]Din Rep'!$C:$M,6,0)),\"\")","v":46.324999999999996},{"$f":"IFERROR(IFERROR(VLOOKUP(B33,'[1]Din Rep'!$B:$M,8,0),VLOOKUP(C33,'[1]Din Rep'!$C:$M,7,0)),\"\")","v":119.9},{"$f":"IFERROR(IFERROR(VLOOKUP(B33,'[1]Din Rep'!$B:$M,10,0),VLOOKUP(C33,'[1]Din Rep'!$C:$M,9,0)),\"\")","v":2.5882352941176476},{"$f":"IFERROR(IFERROR(VLOOKUP(B33,'[1]Din Rep'!$B:$M,11,0),VLOOKUP(C33,'[1]Din Rep'!$C:$M,10,0)),\"\")","v":0},{"$f":"IFERROR(IFERROR(VLOOKUP(B33,'[1]Din Rep'!$B:$M,12,0),VLOOKUP(C33,'[1]Din Rep'!$C:$M,11,0)),\"\")","v":"ESTOQUE"}]
[null,"UV037I00DSM1A",{"$f":"IFERROR(VLOOKUP(B34,'[1]Din Rep'!$B:$M,2,0),\"\")","v":"CAMISETA MANGA LONGA INFANTIL DRY SMART 1A  UV MORMAII"},{"$f":"IFERROR(IFERROR(VLOOKUP(B34,'[1]Din Rep'!$B:$M,5,0),VLOOKUP(C34,'[1]Din Rep'!$C:$M,4,0)),\"\")","v":43.545499999999997},{"$f":"IFERROR(IFERROR(VLOOKUP(B34,'[1]Din Rep'!$B:$M,7,0),VLOOKUP(C34,'[1]Din Rep'!$C:$M,6,0)),\"\")","v":46.324999999999996},{"$f":"IFERROR(IFERROR(VLOOKUP(B34,'[1]Din Rep'!$B:$M,8,0),VLOOKUP(C34,'[1]Din Rep'!$C:$M,7,0)),\"\")","v":119.9},{"$f":"IFERROR(IFERROR(VLOOKUP(B34,'[1]Din Rep'!$B:$M,10,0),VLOOKUP(C34,'[1]Din Rep'!$C:$M,9,0)),\"\")","v":2.5882352941176476},{"$f":"IFERROR(IFERROR(VLOOKUP(B34,'[1]Din Rep'!$B:$M,11,0),VLOOKUP(C34,'[1]Din Rep'!$C:$M,10,0)),\"\")","v":0},{"$f":"IFERROR(IFERROR(VLOOKUP(B34,'[1]Din Rep'!$B:$M,12,0),VLOOKUP(C34,'[1]Din Rep'!$C:$M,11,0)),\"\")","v":"ESTOQUE"}]
[null,"UV041I00DSM1A",{"$f":"IFERROR(VLOOKUP(B35,'[1]Din Rep'!$B:$M,2,0),\"\")","v":"CAMISETA MANGA CURTA INFANTIL DRY SMART 1A UV MORMAII"},{"$f":"IFERROR(IFERROR(VLOOKUP(B35,'[1]Din Rep'!$B:$M,5,0),VLOOKUP(C35,'[1]Din Rep'!$C:$M,4,0)),\"\")","v":39.910049999999998},{"$f":"IFERROR(IFERROR(VLOOKUP(B35,'[1]Din Rep'!$B:$M,7,0),VLOOKUP(C35,'[1]Din Rep'!$C:$M,6,0)),\"\")","v":42.457500000000003},{"$f":"IFERROR(IFERROR(VLOOKUP(B35,'[1]Din Rep'!$B:$M,8,0),VLOOKUP(C35,'[1]Din Rep'!$C:$M,7,0)),\"\")","v":109.9},{"$f":"IFERROR(IFERROR(VLOOKUP(B35,'[1]Din Rep'!$B:$M,10,0),VLOOKUP(C35,'[1]Din Rep'!$C:$M,9,0)),\"\")","v":2.5884708237649412},{"$f":"IFERROR(IFERROR(VLOOKUP(B35,'[1]Din Rep'!$B:$M,11,0),VLOOKUP(C35,'[1]Din Rep'!$C:$M,10,0)),\"\")","v":0},{"$f":"IFERROR(IFERROR(VLOOKUP(B35,'[1]Din Rep'!$B:$M,12,0),VLOOKUP(C35,'[1]Din Rep'!$C:$M,11,0)),\"\")","v":"ESTOQUE"}]
[null,"UV037I00DAM3C",{"$f":"IFERROR(VLOOKUP(B36,'[1]Din Rep'!$B:$M,2,0),\"\")","v":"CAMISETA MANGA LONGA INFANTIL DRY ACTION 3C UV MORMAII"},{"$f":"IFERROR(IFERROR(VLOOKUP(B36,'[1]Din Rep'!$B:$M,5,0),VLOOKUP(C36,'[1]Din Rep'!$C:$M,4,0)),\"\")","v":32.64714},{"$f":"IFERROR(IFERROR(VLOOKUP(B36,'[1]Din Rep'!$B:$M,7,0),VLOOKUP(C36,'[1]Din Rep'!$C:$M,6,0)),\"\")","v":34.731000000000002},{"$f":"IFERROR(IFERROR(VLOOKUP(B36,'[1]Din Rep'!$B:$M,8,0),VLOOKUP(C36,'[1]Din Rep'!$C:$M,7,0)),\"\")","v":89.9},{"$f":"IFERROR(IFERROR(VLOOKUP(B36,'[1]Din Rep'!$B:$M,10,0),VLOOKUP(C36,'[1]Din Rep'!$C:$M,9,0)),\"\")","v":2.5884656358872475},{"$f":"IFERROR(IFERROR(VLOOKUP(B36,'[1]Din Rep'!$B:$M,11,0),VLOOKUP(C36,'[1]Din Rep'!$C:$M,10,0)),\"\")","v":0},{"$f":"IFERROR(IFERROR(VLOOKUP(B36,'[1]Din Rep'!$B:$M,12,0),VLOOKUP(C36,'[1]Din Rep'!$C:$M,11,0)),\"\")","v":"ESTOQUE"}]
[null,"UV041I00DAM3C",{"$f":"IFERROR(VLOOKUP(B37,'[1]Din Rep'!$B:$M,2,0),\"\")","v":"CAMISETA MANGA CURTA INFANTIL DRY ACTION 3C UV MORMAII"},{"$f":"IFERROR(IFERROR(VLOOKUP(B37,'[1]Din Rep'!$B:$M,5,0),VLOOKUP(C37,'[1]Din Rep'!$C:$M,4,0)),\"\")","v":29.019679999999997},{"$f":"IFERROR(IFERROR(VLOOKUP(B37,'[1]Din Rep'!$B:$M,7,0),VLOOKUP(C37,'[1]Din Rep'!$C:$M,6,0)),\"\")","v":30.872},{"$f":"IFERROR(IFERROR(VLOOKUP(B37,'[1]Din Rep'!$B:$M,8,0),VLOOKUP(C37,'[1]Din Rep'!$C:$M,7,0)),\"\")","v":79.900000000000006},{"$f":"IFERROR(IFERROR(VLOOKUP(B37,'[1]Din Rep'!$B:$M,10,0),VLOOKUP(C37,'[1]Din Rep'!$C:$M,9,0)),\"\")","v":2.5881057268722469},{"$f":"IFERROR(IFERROR(VLOOKUP(B37,'[1]Din Rep'!$B:$M,11,0),VLOOKUP(C37,'[1]Din Rep'!$C:$M,10,0)),\"\")","v":0},{"$f":"IFERROR(IFERROR(VLOOKUP(B37,'[1]Din Rep'!$B:$M,12,0),VLOOKUP(C37,'[1]Din Rep'!$C:$M,11,0)),\"\")","v":"ESTOQUE"}]
["5 - BABY","UV056B00ACE2A",{"$f":"IFERROR(VLOOKUP(B38,'[1]Din Rep'!$B:$M,2,0),\"\")","v":"BONE LEGIONARIOS MASCULINO"},{"$f":"IFERROR(IFERROR(VLOOKUP(B38,'[1]Din Rep'!$B:$M,5,0),VLOOKUP(C38,'[1]Din Rep'!$C:$M,4,0)),\"\")","v":39.910049999999998},{"$f":"IFERROR(IFERROR(VLOOKUP(B38,'[1]Din Rep'!$B:$M,7,0),VLOOKUP(C38,'[1]Din Rep'!$C:$M,6,0)),\"\")","v":42.457500000000003},{"$f":"IFERROR(IFERROR(VLOOKUP(B38,'[1]Din Rep'!$B:$M,8,0),VLOOKUP(C38,'[1]Din Rep'!$C:$M,7,0)),\"\")","v":109.89},{"$f":"IFERROR(IFERROR(VLOOKUP(B38,'[1]Din Rep'!$B:$M,10,0),VLOOKUP(C38,'[1]Din Rep'!$C:$M,9,0)),\"\")","v":2.5882352941176467},{"$f":"IFERROR(IFERROR(VLOOKUP(B38,'[1]Din Rep'!$B:$M,11,0),VLOOKUP(C38,'[1]Din Rep'!$C:$M,10,0)),\"\")","v":0},{"$f":"IFERROR(IFERROR(VLOOKUP(B38,'[1]Din Rep'!$B:$M,12,0),VLOOKUP(C38,'[1]Din Rep'!$C:$M,11,0)),\"\")","v":"ESTOQUE"}]
[null,"UV056B00ACE2B",{"$f":"IFERROR(VLOOKUP(B39,'[1]Din Rep'!$B:$M,2,0),\"\")","v":"BONE LEGIONARIOS FEMININO"},{"$f":"IFERROR(IFERROR(VLOOKUP(B39,'[1]Din Rep'!$B:$M,5,0),VLOOKUP(C39,'[1]Din Rep'!$C:$M,4,0)),\"\")","v":39.910049999999998},{"$f":"IFERROR(IFERROR(VLOOKUP(B39,'[1]Din Rep'!$B:$M,7,0),VLOOKUP(C39,'[1]Din Rep'!$C:$M,6,0)),\"\")","v":42.457500000000003},{"$f":"IFERROR(IFERROR(VLOOKUP(B39,'[1]Din Rep'!$B:$M,8,0),VLOOKUP(C39,'[1]Din Rep'!$C:$M,7,0)),\"\")","v":109.89},{"$f":"IFERROR(IFERROR(VLOOKUP(B39,'[1]Din Rep'!$B:$M,10,0),VLOOKUP(C39,'[1]Din Rep'!$C:$M,9,0)),\"\")","v":2.5882352941176467},{"$f":"IFERROR(IFERROR(VLOOKUP(B39,'[1]Din Rep'!$B:$M,11,0),VLOOKUP(C39,'[1]Din Rep'!$C:$M,10,0)),\"\")","v":0},{"$f":"IFERROR(IFERROR(VLOOKUP(B39,'[1]Din Rep'!$B:$M,12,0),VLOOKUP(C39,'[1]Din Rep'!$C:$M,11,0)),\"\")","v":"ESTOQUE"}]
[null,"UV057B00ACE2A",{"$f":"IFERROR(VLOOKUP(B40,'[1]Din Rep'!$B:$M,2,0),\"\")","v":"CHAPEU REVERSIVEL MASCULINO"},{"$f":"IFERROR(IFERROR(VLOOKUP(B40,'[1]Din Rep'!$B:$M,5,0),VLOOKUP(C40,'[1]Din Rep'!$C:$M,4,0)),\"\")","v":43.905050000000003},{"$f":"IFERROR(IFERROR(VLOOKUP(B40,'[1]Din Rep'!$B:$M,7,0),VLOOKUP(C40,'[1]Din Rep'!$C:$M,6,0)),\"\")","v":46.707500000000003},{"$f":"IFERROR(IFERROR(VLOOKUP(B40,'[1]Din Rep'!$B:$M,8,0),VLOOKUP(C40,'[1]Din Rep'!$C:$M,7,0)),\"\")","v":120.89},{"$f":"IFERROR(IFERROR(VLOOKUP(B40,'[1]Din Rep'!$B:$M,10,0),VLOOKUP(C40,'[1]Din Rep'!$C:$M,9,0)),\"\")","v":2.5882352941176467},{"$f":"IFERROR(IFERROR(VLOOKUP(B40,'[1]Din Rep'!$B:$M,11,0),VLOOKUP(C40,'[1]Din Rep'!$C:$M,10,0)),\"\")","v":0},{"$f":"IFERROR(IFERROR(VLOOKUP(B40,'[1]Din Rep'!$B:$M,12,0),VLOOKUP(C40,'[1]Din Rep'!$C:$M,11,0)),\"\")","v":"ESTOQUE"}]
[null,"UV057B00ACE2B",{"$f":"IFERROR(VLOOKUP(B41,'[1]Din Rep'!$B:$M,2,0),\"\")","v":"CHAPEU REVERSIVEL FEMININO"},{"$f":"IFERROR(IFERROR(VLOOKUP(B41,'[1]Din Rep'!$B:$M,5,0),VLOOKUP(C41,'[1]Din Rep'!$C:$M,4,0)),\"\")","v":43.905050000000003},{"$f":"IFERROR(IFERROR(VLOOKUP(B41,'[1]Din Rep'!$B:$M,7,0),VLOOKUP(C41,'[1]Din Rep'!$C:$M,6,0)),\"\")","v":46.707500000000003},{"$f":"IFERROR(IFERROR(VLOOKUP(B41,'[1]Din Rep'!$B:$M,8,0),VLOOKUP(C41,'[1]Din Rep'!$C:$M,7,0)),\"\")","v":120.89},{"$f":"IFERROR(IFERROR(VLOOKUP(B41,'[1]Din Rep'!$B:$M,10,0),VLOOKUP(C41,'[1]Din Rep'!$C:$M,9,0)),\"\")","v":2.5882352941176467},{"$f":"IFERROR(IFERROR(VLOOKUP(B41,'[1]Din Rep'!$B:$M,11,0),VLOOKUP(C41,'[1]Din Rep'!$C:$M,10,0)),\"\")","v":0},{"$f":"IFERROR(IFERROR(VLOOKUP(B41,'[1]Din Rep'!$B:$M,12,0),VLOOKUP(C41,'[1]Din Rep'!$C:$M,11,0)),\"\")","v":"ESTOQUE"}]
[null,"UV017B00DSM1A",{"$f":"IFERROR(VLOOKUP(B42,'[1]Din Rep'!$B:$M,2,0),\"\")","v":"MACAQUINHO MANGA LONGA MASCULINO"},{"$f":"IFERROR(IFERROR(VLOOKUP(B42,'[1]Din Rep'!$B:$M,5,0),VLOOKUP(C42,'[1]Din Rep'!$C:$M,4,0)),\"\")","v":70.799390000000002},{"$f":"IFERROR(IFERROR(VLOOKUP(B42,'[1]Din Rep'!$B:$M,7,0),VLOOKUP(C42,'[1]Din Rep'!$C:$M,6,0)),\"\")","v":75.3185},{"$f":"IFERROR(IFERROR(VLOOKUP(B42,'[1]Din Rep'!$B:$M,8,0),VLOOKUP(C42,'[1]Din Rep'!$C:$M,7,0)),\"\")","v":194.94},{"$f":"IFERROR(IFERROR(VLOOKUP(B42,'[1]Din Rep'!$B:$M,10,0),VLOOKUP(C42,'[1]Din Rep'!$C:$M,9,0)),\"\")","v":2.588208740216547},{"$f":"IFERROR(IFERROR(VLOOKUP(B42,'[1]Din Rep'!$B:$M,11,0),VLOOKUP(C42,'[1]Din Rep'!$C:$M,10,0)),\"\")","v":0},{"$f":"IFERROR(IFERROR(VLOOKUP(B42,'[1]Din Rep'!$B:$M,12,0),VLOOKUP(C42,'[1]Din Rep'!$C:$M,11,0)),\"\")","v":"ESTOQUE"}]
[null,"UV017B00DSM1B",{"$f":"IFERROR(VLOOKUP(B43,'[1]Din Rep'!$B:$M,2,0),\"\")","v":"MACAQUINHO MANGA LONGA FEMININO"},{"$f":"IFERROR(IFERROR(VLOOKUP(B43,'[1]Din Rep'!$B:$M,5,0),VLOOKUP(C43,'[1]Din Rep'!$C:$M,4,0)),\"\")","v":70.799390000000002},{"$f":"IFERROR(IFERROR(VLOOKUP(B43,'[1]Din Rep'!$B:$M,7,0),VLOOKUP(C43,'[1]Din Rep'!$C:$M,6,0)),\"\")","v":75.3185},{"$f":"IFERROR(IFERROR(VLOOKUP(B43,'[1]Din Rep'!$B:$M,8,0),VLOOKUP(C43,'[1]Din Rep'!$C:$M,7,0)),\"\")","v":194.94},{"$f":"IFERROR(IFERROR(VLOOKUP(B43,'[1]Din Rep'!$B:$M,10,0),VLOOKUP(C43,'[1]Din Rep'!$C:$M,9,0)),\"\")","v":2.588208740216547},{"$f":"IFERROR(IFERROR(VLOOKUP(B43,'[1]Din Rep'!$B:$M,11,0),VLOOKUP(C43,'[1]Din Rep'!$C:$M,10,0)),\"\")","v":0},{"$f":"IFERROR(IFERROR(VLOOKUP(B43,'[1]Din Rep'!$B:$M,12,0),VLOOKUP(C43,'[1]Din Rep'!$C:$M,11,0)),\"\")","v":"ESTOQUE"}]
[null,"UV037B00DSM1A",{"$f":"IFERROR(VLOOKUP(B44,'[1]Din Rep'!$B:$M,2,0),\"\")","v":"CAMISETA MANGA LONGA BABY MASCULINO"},{"$f":"IFERROR(IFERROR(VLOOKUP(B44,'[1]Din Rep'!$B:$M,5,0),VLOOKUP(C44,'[1]Din Rep'!$C:$M,4,0)),\"\")","v":39.910049999999998},{"$f":"IFERROR(IFERROR(VLOOKUP(B44,'[1]Din Rep'!$B:$M,7,0),VLOOKUP(C44,'[1]Din Rep'!$C:$M,6,0)),\"\")","v":42.457500000000003},{"$f":"IFERROR(IFERROR(VLOOKUP(B44,'[1]Din Rep'!$B:$M,8,0),VLOOKUP(C44,'[1]Din Rep'!$C:$M,7,0)),\"\")","v":109.89},{"$f":"IFERROR(IFERROR(VLOOKUP(B44,'[1]Din Rep'!$B:$M,10,0),VLOOKUP(C44,'[1]Din Rep'!$C:$M,9,0)),\"\")","v":2.5882352941176467},{"$f":"IFERROR(IFERROR(VLOOKUP(B44,'[1]Din Rep'!$B:$M,11,0),VLOOKUP(C44,'[1]Din Rep'!$C:$M,10,0)),\"\")","v":0},{"$f":"IFERROR(IFERROR(VLOOKUP(B44,'[1]Din Rep'!$B:$M,12,0),VLOOKUP(C44,'[1]Din Rep'!$C:$M,11,0)),\"\")","v":"ESTOQUE"}]
[null,"UV037B00DSM1B",{"$f":"IFERROR(VLOOKUP(B45,'[1]Din Rep'!$B:$M,2,0),\"\")","v":"CAMISETA MANGA LONGA BABY FEMININO"},{"$f":"IFERROR(IFERROR(VLOOKUP(B45,'[1]Din Rep'!$B:$M,5,0),VLOOKUP(C45,'[1]Din Rep'!$C:$M,4,0)),\"\")","v":39.910049999999998},{"$f":"IFERROR(IFERROR(VLOOKUP(B45,'[1]Din Rep'!$B:$M,7,0),VLOOKUP(C45,'[1]Din Rep'!$C:$M,6,0)),\"\")","v":42.457500000000003},{"$f":"IFERROR(IFERROR(VLOOKUP(B45,'[1]Din Rep'!$B:$M,8,0),VLOOKUP(C45,'[1]Din Rep'!$C:$M,7,0)),\"\")","v":109.89},{"$f":"IFERROR(IFERROR(VLOOKUP(B45,'[1]Din Rep'!$B:$M,10,0),VLOOKUP(C45,'[1]Din Rep'!$C:$M,9,0)),\"\")","v":2.5882352941176467},{"$f":"IFERROR(IFERROR(VLOOKUP(B45,'[1]Din Rep'!$B:$M,11,0),VLOOKUP(C45,'[1]Din Rep'!$C:$M,10,0)),\"\")","v":0},{"$f":"IFERROR(IFERROR(VLOOKUP(B45,'[1]Din Rep'!$B:$M,12,0),VLOOKUP(C45,'[1]Din Rep'!$C:$M,11,0)),\"\")","v":"ESTOQUE"}]

{"sheet":"MERGULHO-CAÇA","index":4,"n_rows":38,"n_cols":9,"rows_kept":38,"cut":false,"hidden":false,"merged":[[7,0,10,0],[11,0,16,0],[17,0,36,0]]}
[]
[]
[]
[]
[]
["LINHA","REFERENCIA","DESCRIÇÃO","À VISTA","À PRAZO","SUGESTÃO","MARK UP","IPI","ENTREGA"]
["1 - NEXXXUS","MNO1352B",{"$f":"IFERROR(VLOOKUP(B7,'[1]Din Rep'!$B:$M,2,0),\"\")","v":"MACACÃO MANGA LONGA NOZIP 5 MM MASCULINO NEXXXUS 1A MERGULHO MORMAII"},{"$f":"IFERROR(IFERROR(VLOOKUP(B7,'[1]Din Rep'!$B:$M,5,0),VLOOKUP(C7,'[1]Din Rep'!$C:$M,4,0)),\"\")","v":511.32004999999998},{"$f":"IFERROR(IFERROR(VLOOKUP(B7,'[1]Din Rep'!$B:$M,7,0),VLOOKUP(C7,'[1]Din Rep'!$C:$M,6,0)),\"\")","v":543.95749999999998},{"$f":"IFERROR(IFERROR(VLOOKUP(B7,'[1]Din Rep'!$B:$M,8,0),VLOOKUP(C7,'[1]Din Rep'!$C:$M,7,0)),\"\")","v":1023.9200000000001},{"$f":"IFERROR(IFERROR(VLOOKUP(B7,'[1]Din Rep'!$B:$M,10,0),VLOOKUP(C7,'[1]Din Rep'!$C:$M,9,0)),\"\")","v":1.8823529411764708},{"$f":"IFERROR(IFERROR(VLOOKUP(B7,'[1]Din Rep'!$B:$M,11,0),VLOOKUP(C7,'[1]Din Rep'!$C:$M,10,0)),\"\")","v":0},{"$f":"IFERROR(IFERROR(VLOOKUP(B7,'[1]Din Rep'!$B:$M,12,0),VLOOKUP(C7,'[1]Din Rep'!$C:$M,11,0)),\"\")","v":"45 DD"}]
["2 - ATLANTIS","MAFG30832B",{"$f":"IFERROR(VLOOKUP(B8,'[1]Din Rep'!$B:$M,2,0),\"\")","v":"SHORT JOHN MANGA CURTA BACKZIP 3 MM FEMININO ATLANTIS 2A MERGULHO MORMAII"},{"$f":"IFERROR(IFERROR(VLOOKUP(B8,'[1]Din Rep'!$B:$M,5,0),VLOOKUP(C8,'[1]Din Rep'!$C:$M,4,0)),\"\")","v":231.67004999999997},{"$f":"IFERROR(IFERROR(VLOOKUP(B8,'[1]Din Rep'!$B:$M,7,0),VLOOKUP(C8,'[1]Din Rep'!$C:$M,6,0)),\"\")","v":246.45749999999998},{"$f":"IFERROR(IFERROR(VLOOKUP(B8,'[1]Din Rep'!$B:$M,8,0),VLOOKUP(C8,'[1]Din Rep'!$C:$M,7,0)),\"\")","v":463.92},{"$f":"IFERROR(IFERROR(VLOOKUP(B8,'[1]Din Rep'!$B:$M,10,0),VLOOKUP(C8,'[1]Din Rep'!$C:$M,9,0)),\"\")","v":1.8823529411764708},{"$f":"IFERROR(IFERROR(VLOOKUP(B8,'[1]Din Rep'!$B:$M,11,0),VLOOKUP(C8,'[1]Din Rep'!$C:$M,10,0)),\"\")","v":0},{"$f":"IFERROR(IFERROR(VLOOKUP(B8,'[1]Din Rep'!$B:$M,12,0),VLOOKUP(C8,'[1]Din Rep'!$C:$M,11,0)),\"\")","v":"45 DD"}]
[null,"MAFG31342B",{"$f":"IFERROR(VLOOKUP(B9,'[1]Din Rep'!$B:$M,2,0),\"\")","v":"MACACÃO MANGA LONGA FRONTZIP 4 MM FEMININO ATLANTIS 2A MERGULHO MORMAII"},{"$f":"IFERROR(IFERROR(VLOOKUP(B9,'[1]Din Rep'!$B:$M,5,0),VLOOKUP(C9,'[1]Din Rep'!$C:$M,4,0)),\"\")","v":449.38756249999994},{"$f":"IFERROR(IFERROR(VLOOKUP(B9,'[1]Din Rep'!$B:$M,7,0),VLOOKUP(C9,'[1]Din Rep'!$C:$M,6,0)),\"\")","v":478.07187499999998},{"$f":"IFERROR(IFERROR(VLOOKUP(B9,'[1]Din Rep'!$B:$M,8,0),VLOOKUP(C9,'[1]Din Rep'!$C:$M,7,0)),\"\")","v":899.90000000000009},{"$f":"IFERROR(IFERROR(VLOOKUP(B9,'[1]Din Rep'!$B:$M,10,0),VLOOKUP(C9,'[1]Din Rep'!$C:$M,9,0)),\"\")","v":1.8823529411764708},{"$f":"IFERROR(IFERROR(VLOOKUP(B9,'[1]Din Rep'!$B:$M,11,0),VLOOKUP(C9,'[1]Din Rep'!$C:$M,10,0)),\"\")","v":0},{"$f":"IFERROR(IFERROR(VLOOKUP(B9,'[1]Din Rep'!$B:$M,12,0),VLOOKUP(C9,'[1]Din Rep'!$C:$M,11,0)),\"\")","v":"45 DD"}]
[null,"MAG30832B",{"$f":"IFERROR(VLOOKUP(B10,'[1]Din Rep'!$B:$M,2,0),\"\")","v":"SHORT JOHN MANGA CURTA BACKZIP 3 MM MASCULINO ATLANTIS 2A MERGULHO MORMAII"},{"$f":"IFERROR(IFERROR(VLOOKUP(B10,'[1]Din Rep'!$B:$M,5,0),VLOOKUP(C10,'[1]Din Rep'!$C:$M,4,0)),\"\")","v":231.67004999999997},{"$f":"IFERROR(IFERROR(VLOOKUP(B10,'[1]Din Rep'!$B:$M,7,0),VLOOKUP(C10,'[1]Din Rep'!$C:$M,6,0)),\"\")","v":246.45749999999998},{"$f":"IFERROR(IFERROR(VLOOKUP(B10,'[1]Din Rep'!$B:$M,8,0),VLOOKUP(C10,'[1]Din Rep'!$C:$M,7,0)),\"\")","v":463.92},{"$f":"IFERROR(IFERROR(VLOOKUP(B10,'[1]Din Rep'!$B:$M,10,0),VLOOKUP(C10,'[1]Din Rep'!$C:$M,9,0)),\"\")","v":1.8823529411764708},{"$f":"IFERROR(IFERROR(VLOOKUP(B10,'[1]Din Rep'!$B:$M,11,0),VLOOKUP(C10,'[1]Din Rep'!$C:$M,10,0)),\"\")","v":0},{"$f":"IFERROR(IFERROR(VLOOKUP(B10,'[1]Din Rep'!$B:$M,12,0),VLOOKUP(C10,'[1]Din Rep'!$C:$M,11,0)),\"\")","v":"45 DD"}]
[null,"MAG31342B",{"$f":"IFERROR(VLOOKUP(B11,'[1]Din Rep'!$B:$M,2,0),\"\")","v":"MACACÃO MANGA LONGA FRONTZIP 4 MM MASCULINO ATLANTIS 2A MERGULHO MORMAII"},{"$f":"IFERROR(IFERROR(VLOOKUP(B11,'[1]Din Rep'!$B:$M,5,0),VLOOKUP(C11,'[1]Din Rep'!$C:$M,4,0)),\"\")","v":449.38756249999994},{"$f":"IFERROR(IFERROR(VLOOKUP(B11,'[1]Din Rep'!$B:$M,7,0),VLOOKUP(C11,'[1]Din Rep'!$C:$M,6,0)),\"\")","v":478.07187499999998},{"$f":"IFERROR(IFERROR(VLOOKUP(B11,'[1]Din Rep'!$B:$M,8,0),VLOOKUP(C11,'[1]Din Rep'!$C:$M,7,0)),\"\")","v":899.90000000000009},{"$f":"IFERROR(IFERROR(VLOOKUP(B11,'[1]Din Rep'!$B:$M,10,0),VLOOKUP(C11,'[1]Din Rep'!$C:$M,9,0)),\"\")","v":1.8823529411764708},{"$f":"IFERROR(IFERROR(VLOOKUP(B11,'[1]Din Rep'!$B:$M,11,0),VLOOKUP(C11,'[1]Din Rep'!$C:$M,10,0)),\"\")","v":0},{"$f":"IFERROR(IFERROR(VLOOKUP(B11,'[1]Din Rep'!$B:$M,12,0),VLOOKUP(C11,'[1]Din Rep'!$C:$M,11,0)),\"\")","v":"45 DD"}]
["3 - KAPTOR","MK60432",{"$f":"IFERROR(VLOOKUP(B12,'[1]Din Rep'!$B:$M,2,0),\"\")","v":"CASACO MANGA LONGA C/ CAPUZ 3 MM MASCULINO KAPTOR 1A MERGULHO MORMAII"},{"$f":"IFERROR(IFERROR(VLOOKUP(B12,'[1]Din Rep'!$B:$M,5,0),VLOOKUP(C12,'[1]Din Rep'!$C:$M,4,0)),\"\")","v":231.67004999999997},{"$f":"IFERROR(IFERROR(VLOOKUP(B12,'[1]Din Rep'!$B:$M,7,0),VLOOKUP(C12,'[1]Din Rep'!$C:$M,6,0)),\"\")","v":246.45749999999998},{"$f":"IFERROR(IFERROR(VLOOKUP(B12,'[1]Din Rep'!$B:$M,8,0),VLOOKUP(C12,'[1]Din Rep'!$C:$M,7,0)),\"\")","v":463.92},{"$f":"IFERROR(IFERROR(VLOOKUP(B12,'[1]Din Rep'!$B:$M,10,0),VLOOKUP(C12,'[1]Din Rep'!$C:$M,9,0)),\"\")","v":1.8823529411764708},{"$f":"IFERROR(IFERROR(VLOOKUP(B12,'[1]Din Rep'!$B:$M,11,0),VLOOKUP(C12,'[1]Din Rep'!$C:$M,10,0)),\"\")","v":0},{"$f":"IFERROR(IFERROR(VLOOKUP(B12,'[1]Din Rep'!$B:$M,12,0),VLOOKUP(C12,'[1]Din Rep'!$C:$M,11,0)),\"\")","v":"45 DD"}]
[null,"MK61132",{"$f":"IFERROR(VLOOKUP(B13,'[1]Din Rep'!$B:$M,2,0),\"\")","v":"CALÇA 3 MM MASCULINO KAPTOR 1A MERGULHO MORMAII"},{"$f":"IFERROR(IFERROR(VLOOKUP(B13,'[1]Din Rep'!$B:$M,5,0),VLOOKUP(C13,'[1]Din Rep'!$C:$M,4,0)),\"\")","v":251.64504999999997},{"$f":"IFERROR(IFERROR(VLOOKUP(B13,'[1]Din Rep'!$B:$M,7,0),VLOOKUP(C13,'[1]Din Rep'!$C:$M,6,0)),\"\")","v":267.70749999999998},{"$f":"IFERROR(IFERROR(VLOOKUP(B13,'[1]Din Rep'!$B:$M,8,0),VLOOKUP(C13,'[1]Din Rep'!$C:$M,7,0)),\"\")","v":503.92},{"$f":"IFERROR(IFERROR(VLOOKUP(B13,'[1]Din Rep'!$B:$M,10,0),VLOOKUP(C13,'[1]Din Rep'!$C:$M,9,0)),\"\")","v":1.8823529411764708},{"$f":"IFERROR(IFERROR(VLOOKUP(B13,'[1]Din Rep'!$B:$M,11,0),VLOOKUP(C13,'[1]Din Rep'!$C:$M,10,0)),\"\")","v":0},{"$f":"IFERROR(IFERROR(VLOOKUP(B13,'[1]Din Rep'!$B:$M,12,0),VLOOKUP(C13,'[1]Din Rep'!$C:$M,11,0)),\"\")","v":"45 DD"}]
[null,"ME053M40KPT1A",{"$f":"IFERROR(VLOOKUP(B14,'[1]Din Rep'!$B:$M,2,0),\"\")","v":"CALÇA 4 MM MASCULINO KAPTOR 1A MERGULHO MORMAII"},{"$f":"IFERROR(IFERROR(VLOOKUP(B14,'[1]Din Rep'!$B:$M,5,0),VLOOKUP(C14,'[1]Din Rep'!$C:$M,4,0)),\"\")","v":239.66004999999996},{"$f":"IFERROR(IFERROR(VLOOKUP(B14,'[1]Din Rep'!$B:$M,7,0),VLOOKUP(C14,'[1]Din Rep'!$C:$M,6,0)),\"\")","v":254.95749999999998},{"$f":"IFERROR(IFERROR(VLOOKUP(B14,'[1]Din Rep'!$B:$M,8,0),VLOOKUP(C14,'[1]Din Rep'!$C:$M,7,0)),\"\")","v":479.92},{"$f":"IFERROR(IFERROR(VLOOKUP(B14,'[1]Din Rep'!$B:$M,10,0),VLOOKUP(C14,'[1]Din Rep'!$C:$M,9,0)),\"\")","v":1.8823529411764708},{"$f":"IFERROR(IFERROR(VLOOKUP(B14,'[1]Din Rep'!$B:$M,11,0),VLOOKUP(C14,'[1]Din Rep'!$C:$M,10,0)),\"\")","v":0},{"$f":"IFERROR(IFERROR(VLOOKUP(B14,'[1]Din Rep'!$B:$M,12,0),VLOOKUP(C14,'[1]Din Rep'!$C:$M,11,0)),\"\")","v":"45 DD"}]
[null,"ME025M40KPT1A",{"$f":"IFERROR(VLOOKUP(B15,'[1]Din Rep'!$B:$M,2,0),\"\")","v":"CASACO MANGA LONGA C/ CAPUZ 4 MM MASCULINO KAPTOR 1A MERGULHO MORMAII"},{"$f":"IFERROR(IFERROR(VLOOKUP(B15,'[1]Din Rep'!$B:$M,5,0),VLOOKUP(C15,'[1]Din Rep'!$C:$M,4,0)),\"\")","v":259.63504999999998},{"$f":"IFERROR(IFERROR(VLOOKUP(B15,'[1]Din Rep'!$B:$M,7,0),VLOOKUP(C15,'[1]Din Rep'!$C:$M,6,0)),\"\")","v":276.20749999999998},{"$f":"IFERROR(IFERROR(VLOOKUP(B15,'[1]Din Rep'!$B:$M,8,0),VLOOKUP(C15,'[1]Din Rep'!$C:$M,7,0)),\"\")","v":519.91999999999996},{"$f":"IFERROR(IFERROR(VLOOKUP(B15,'[1]Din Rep'!$B:$M,10,0),VLOOKUP(C15,'[1]Din Rep'!$C:$M,9,0)),\"\")","v":1.8823529411764706},{"$f":"IFERROR(IFERROR(VLOOKUP(B15,'[1]Din Rep'!$B:$M,11,0),VLOOKUP(C15,'[1]Din Rep'!$C:$M,10,0)),\"\")","v":0},{"$f":"IFERROR(IFERROR(VLOOKUP(B15,'[1]Din Rep'!$B:$M,12,0),VLOOKUP(C15,'[1]Din Rep'!$C:$M,11,0)),\"\")","v":"45 DD"}]
[null,"ME053M50KPT1A",{"$f":"IFERROR(VLOOKUP(B16,'[1]Din Rep'!$B:$M,2,0),\"\")","v":"CALÇA 5 MM MASCULINO KAPTOR 1A MERGULHO MORMAII"},{"$f":"IFERROR(IFERROR(VLOOKUP(B16,'[1]Din Rep'!$B:$M,5,0),VLOOKUP(C16,'[1]Din Rep'!$C:$M,4,0)),\"\")","v":255.64004999999997},{"$f":"IFERROR(IFERROR(VLOOKUP(B16,'[1]Din Rep'!$B:$M,7,0),VLOOKUP(C16,'[1]Din Rep'!$C:$M,6,0)),\"\")","v":271.95749999999998},{"$f":"IFERROR(IFERROR(VLOOKUP(B16,'[1]Din Rep'!$B:$M,8,0),VLOOKUP(C16,'[1]Din Rep'!$C:$M,7,0)),\"\")","v":511.92},{"$f":"IFERROR(IFERROR(VLOOKUP(B16,'[1]Din Rep'!$B:$M,10,0),VLOOKUP(C16,'[1]Din Rep'!$C:$M,9,0)),\"\")","v":1.8823529411764708},{"$f":"IFERROR(IFERROR(VLOOKUP(B16,'[1]Din Rep'!$B:$M,11,0),VLOOKUP(C16,'[1]Din Rep'!$C:$M,10,0)),\"\")","v":0},{"$f":"IFERROR(IFERROR(VLOOKUP(B16,'[1]Din Rep'!$B:$M,12,0),VLOOKUP(C16,'[1]Din Rep'!$C:$M,11,0)),\"\")","v":"45 DD"}]
[null,"ME025M50KPT1A",{"$f":"IFERROR(VLOOKUP(B17,'[1]Din Rep'!$B:$M,2,0),\"\")","v":"CASACO MANGA LONGA C/ CAPUZ 5 MM MASCULINO KAPTOR 1A MERGULHO MORMAII"},{"$f":"IFERROR(IFERROR(VLOOKUP(B17,'[1]Din Rep'!$B:$M,5,0),VLOOKUP(C17,'[1]Din Rep'!$C:$M,4,0)),\"\")","v":275.61504999999994},{"$f":"IFERROR(IFERROR(VLOOKUP(B17,'[1]Din Rep'!$B:$M,7,0),VLOOKUP(C17,'[1]Din Rep'!$C:$M,6,0)),\"\")","v":293.20749999999998},{"$f":"IFERROR(IFERROR(VLOOKUP(B17,'[1]Din Rep'!$B:$M,8,0),VLOOKUP(C17,'[1]Din Rep'!$C:$M,7,0)),\"\")","v":551.91999999999996},{"$f":"IFERROR(IFERROR(VLOOKUP(B17,'[1]Din Rep'!$B:$M,10,0),VLOOKUP(C17,'[1]Din Rep'!$C:$M,9,0)),\"\")","v":1.8823529411764706},{"$f":"IFERROR(IFERROR(VLOOKUP(B17,'[1]Din Rep'!$B:$M,11,0),VLOOKUP(C17,'[1]Din Rep'!$C:$M,10,0)),\"\")","v":0},{"$f":"IFERROR(IFERROR(VLOOKUP(B17,'[1]Din Rep'!$B:$M,12,0),VLOOKUP(C17,'[1]Din Rep'!$C:$M,11,0)),\"\")","v":"45 DD"}]
["4 - PRO SUITS","B218 ",{"$f":"IFERROR(VLOOKUP(B18,'[1]Din Rep'!$B:$M,2,0),\"\")","v":"LUVA DE ARREBENTAÇÃO NEOPRENE 2MM (Sob encomenda)"},{"$f":"IFERROR(IFERROR(VLOOKUP(B18,'[1]Din Rep'!$B:$M,5,0),VLOOKUP(C18,'[1]Din Rep'!$C:$M,4,0)),\"\")","v":29.523050000000001},{"$f":"IFERROR(IFERROR(VLOOKUP(B18,'[1]Din Rep'!$B:$M,7,0),VLOOKUP(C18,'[1]Din Rep'!$C:$M,6,0)),\"\")","v":31.407500000000002},{"$f":"IFERROR(IFERROR(VLOOKUP(B18,'[1]Din Rep'!$B:$M,8,0),VLOOKUP(C18,'[1]Din Rep'!$C:$M,7,0)),\"\")","v":59.9},{"$f":"IFERROR(IFERROR(VLOOKUP(B18,'[1]Din Rep'!$B:$M,10,0),VLOOKUP(C18,'[1]Din Rep'!$C:$M,9,0)),\"\")","v":1.9071877736209502},{"$f":"IFERROR(IFERROR(VLOOKUP(B18,'[1]Din Rep'!$B:$M,11,0),VLOOKUP(C18,'[1]Din Rep'!$C:$M,10,0)),\"\")","v":0},{"$f":"IFERROR(IFERROR(VLOOKUP(B18,'[1]Din Rep'!$B:$M,12,0),VLOOKUP(C18,'[1]Din Rep'!$C:$M,11,0)),\"\")","v":"45 DD"}]
[null,"M13132",{"$f":"IFERROR(VLOOKUP(B19,'[1]Din Rep'!$B:$M,2,0),\"\")","v":"CAPUZ SUPER LONGO 3MM "},{"$f":"IFERROR(IFERROR(VLOOKUP(B19,'[1]Din Rep'!$B:$M,5,0),VLOOKUP(C19,'[1]Din Rep'!$C:$M,4,0)),\"\")","v":72.533219999999986},{"$f":"IFERROR(IFERROR(VLOOKUP(B19,'[1]Din Rep'!$B:$M,7,0),VLOOKUP(C19,'[1]Din Rep'!$C:$M,6,0)),\"\")","v":77.162999999999997},{"$f":"IFERROR(IFERROR(VLOOKUP(B19,'[1]Din Rep'!$B:$M,8,0),VLOOKUP(C19,'[1]Din Rep'!$C:$M,7,0)),\"\")","v":145.9},{"$f":"IFERROR(IFERROR(VLOOKUP(B19,'[1]Din Rep'!$B:$M,10,0),VLOOKUP(C19,'[1]Din Rep'!$C:$M,9,0)),\"\")","v":1.8908025867319831},{"$f":"IFERROR(IFERROR(VLOOKUP(B19,'[1]Din Rep'!$B:$M,11,0),VLOOKUP(C19,'[1]Din Rep'!$C:$M,10,0)),\"\")","v":0},{"$f":"IFERROR(IFERROR(VLOOKUP(B19,'[1]Din Rep'!$B:$M,12,0),VLOOKUP(C19,'[1]Din Rep'!$C:$M,11,0)),\"\")","v":"45 DD"}]
[null,"M50412B",{"$f":"IFERROR(VLOOKUP(B20,'[1]Din Rep'!$B:$M,2,0),\"\")","v":"CAMISETA MANGA LONGA C/ NEOPRENE 1 MM MASCULINO PRO SUITS 2A MERGULHO MORMAII"},{"$f":"IFERROR(IFERROR(VLOOKUP(B20,'[1]Din Rep'!$B:$M,5,0),VLOOKUP(C20,'[1]Din Rep'!$C:$M,4,0)),\"\")","v":79.860049999999987},{"$f":"IFERROR(IFERROR(VLOOKUP(B20,'[1]Din Rep'!$B:$M,7,0),VLOOKUP(C20,'[1]Din Rep'!$C:$M,6,0)),\"\")","v":84.957499999999996},{"$f":"IFERROR(IFERROR(VLOOKUP(B20,'[1]Din Rep'!$B:$M,8,0),VLOOKUP(C20,'[1]Din Rep'!$C:$M,7,0)),\"\")","v":159.92000000000002},{"$f":"IFERROR(IFERROR(VLOOKUP(B20,'[1]Din Rep'!$B:$M,10,0),VLOOKUP(C20,'[1]Din Rep'!$C:$M,9,0)),\"\")","v":1.8823529411764708},{"$f":"IFERROR(IFERROR(VLOOKUP(B20,'[1]Din Rep'!$B:$M,11,0),VLOOKUP(C20,'[1]Din Rep'!$C:$M,10,0)),\"\")","v":0},{"$f":"IFERROR(IFERROR(VLOOKUP(B20,'[1]Din Rep'!$B:$M,12,0),VLOOKUP(C20,'[1]Din Rep'!$C:$M,11,0)),\"\")","v":"45 DD"}]
[null,"M60132B",{"$f":"IFERROR(VLOOKUP(B21,'[1]Din Rep'!$B:$M,2,0),\"\")","v":"CASACO SEM MANGA C/ CAPUZ 2 MM MASCULINO PRO SUITA 2A MERGULHO MORMAII"},{"$f":"IFERROR(IFERROR(VLOOKUP(B21,'[1]Din Rep'!$B:$M,5,0),VLOOKUP(C21,'[1]Din Rep'!$C:$M,4,0)),\"\")","v":111.82004999999998},{"$f":"IFERROR(IFERROR(VLOOKUP(B21,'[1]Din Rep'!$B:$M,7,0),VLOOKUP(C21,'[1]Din Rep'!$C:$M,6,0)),\"\")","v":118.95749999999998},{"$f":"IFERROR(IFERROR(VLOOKUP(B21,'[1]Din Rep'!$B:$M,8,0),VLOOKUP(C21,'[1]Din Rep'!$C:$M,7,0)),\"\")","v":223.92},{"$f":"IFERROR(IFERROR(VLOOKUP(B21,'[1]Din Rep'!$B:$M,10,0),VLOOKUP(C21,'[1]Din Rep'!$C:$M,9,0)),\"\")","v":1.8823529411764708},{"$f":"IFERROR(IFERROR(VLOOKUP(B21,'[1]Din Rep'!$B:$M,11,0),VLOOKUP(C21,'[1]Din Rep'!$C:$M,10,0)),\"\")","v":0},{"$f":"IFERROR(IFERROR(VLOOKUP(B21,'[1]Din Rep'!$B:$M,12,0),VLOOKUP(C21,'[1]Din Rep'!$C:$M,11,0)),\"\")","v":"45 DD"}]
[null,"M60432B",{"$f":"IFERROR(VLOOKUP(B22,'[1]Din Rep'!$B:$M,2,0),\"\")","v":"CASACO MANGA LONGA C/ CAPUZ 3 MM MASCULINO HUNTER 2A MERGULHO MORMAII"},{"$f":"IFERROR(IFERROR(VLOOKUP(B22,'[1]Din Rep'!$B:$M,5,0),VLOOKUP(C22,'[1]Din Rep'!$C:$M,4,0)),\"\")","v":224.66881249999994},{"$f":"IFERROR(IFERROR(VLOOKUP(B22,'[1]Din Rep'!$B:$M,7,0),VLOOKUP(C22,'[1]Din Rep'!$C:$M,6,0)),\"\")","v":239.00937499999995},{"$f":"IFERROR(IFERROR(VLOOKUP(B22,'[1]Din Rep'!$B:$M,8,0),VLOOKUP(C22,'[1]Din Rep'!$C:$M,7,0)),\"\")","v":449.89999999999992},{"$f":"IFERROR(IFERROR(VLOOKUP(B22,'[1]Din Rep'!$B:$M,10,0),VLOOKUP(C22,'[1]Din Rep'!$C:$M,9,0)),\"\")","v":1.8823529411764706},{"$f":"IFERROR(IFERROR(VLOOKUP(B22,'[1]Din Rep'!$B:$M,11,0),VLOOKUP(C22,'[1]Din Rep'!$C:$M,10,0)),\"\")","v":0},{"$f":"IFERROR(IFERROR(VLOOKUP(B22,'[1]Din Rep'!$B:$M,12,0),VLOOKUP(C22,'[1]Din Rep'!$C:$M,11,0)),\"\")","v":"45 DD"}]
[null,"M60452B",{"$f":"IFERROR(VLOOKUP(B23,'[1]Din Rep'!$B:$M,2,0),\"\")","v":"CASACO MANGA LONGA C/ CAPUZ 5 MM MASCULINO HUNTER 2A MERGULHO MORMAII"},{"$f":"IFERROR(IFERROR(VLOOKUP(B23,'[1]Din Rep'!$B:$M,5,0),VLOOKUP(C23,'[1]Din Rep'!$C:$M,4,0)),\"\")","v":249.63756249999992},{"$f":"IFERROR(IFERROR(VLOOKUP(B23,'[1]Din Rep'!$B:$M,7,0),VLOOKUP(C23,'[1]Din Rep'!$C:$M,6,0)),\"\")","v":265.57187499999992},{"$f":"IFERROR(IFERROR(VLOOKUP(B23,'[1]Din Rep'!$B:$M,8,0),VLOOKUP(C23,'[1]Din Rep'!$C:$M,7,0)),\"\")","v":499.89999999999992},{"$f":"IFERROR(IFERROR(VLOOKUP(B23,'[1]Din Rep'!$B:$M,10,0),VLOOKUP(C23,'[1]Din Rep'!$C:$M,9,0)),\"\")","v":1.8823529411764708},{"$f":"IFERROR(IFERROR(VLOOKUP(B23,'[1]Din Rep'!$B:$M,11,0),VLOOKUP(C23,'[1]Din Rep'!$C:$M,10,0)),\"\")","v":0},{"$f":"IFERROR(IFERROR(VLOOKUP(B23,'[1]Din Rep'!$B:$M,12,0),VLOOKUP(C23,'[1]Din Rep'!$C:$M,11,0)),\"\")","v":"45 DD"}]
[null,"M60732B",{"$f":"IFERROR(VLOOKUP(B24,'[1]Din Rep'!$B:$M,2,0),\"\")","v":"CASACO MANGA LONGA FRONTZIP 3 MM MASCULINO PRO SUITS 2A MERGULHO MORMAII"},{"$f":"IFERROR(IFERROR(VLOOKUP(B24,'[1]Din Rep'!$B:$M,5,0),VLOOKUP(C24,'[1]Din Rep'!$C:$M,4,0)),\"\")","v":231.67004999999997},{"$f":"IFERROR(IFERROR(VLOOKUP(B24,'[1]Din Rep'!$B:$M,7,0),VLOOKUP(C24,'[1]Din Rep'!$C:$M,6,0)),\"\")","v":246.45749999999998},{"$f":"IFERROR(IFERROR(VLOOKUP(B24,'[1]Din Rep'!$B:$M,8,0),VLOOKUP(C24,'[1]Din Rep'!$C:$M,7,0)),\"\")","v":463.92},{"$f":"IFERROR(IFERROR(VLOOKUP(B24,'[1]Din Rep'!$B:$M,10,0),VLOOKUP(C24,'[1]Din Rep'!$C:$M,9,0)),\"\")","v":1.8823529411764708},{"$f":"IFERROR(IFERROR(VLOOKUP(B24,'[1]Din Rep'!$B:$M,11,0),VLOOKUP(C24,'[1]Din Rep'!$C:$M,10,0)),\"\")","v":0},{"$f":"IFERROR(IFERROR(VLOOKUP(B24,'[1]Din Rep'!$B:$M,12,0),VLOOKUP(C24,'[1]Din Rep'!$C:$M,11,0)),\"\")","v":"45 DD"}]
[null,"M60752B",{"$f":"IFERROR(VLOOKUP(B25,'[1]Din Rep'!$B:$M,2,0),\"\")","v":"CASACO MANGA LONGA FRONTZIP 5 MM MASCULINO PRO SUITS 2A MERGULHO MORMAII"},{"$f":"IFERROR(IFERROR(VLOOKUP(B25,'[1]Din Rep'!$B:$M,5,0),VLOOKUP(C25,'[1]Din Rep'!$C:$M,4,0)),\"\")","v":239.66004999999996},{"$f":"IFERROR(IFERROR(VLOOKUP(B25,'[1]Din Rep'!$B:$M,7,0),VLOOKUP(C25,'[1]Din Rep'!$C:$M,6,0)),\"\")","v":254.95749999999998},{"$f":"IFERROR(IFERROR(VLOOKUP(B25,'[1]Din Rep'!$B:$M,8,0),VLOOKUP(C25,'[1]Din Rep'!$C:$M,7,0)),\"\")","v":479.92},{"$f":"IFERROR(IFERROR(VLOOKUP(B25,'[1]Din Rep'!$B:$M,10,0),VLOOKUP(C25,'[1]Din Rep'!$C:$M,9,0)),\"\")","v":1.8823529411764708},{"$f":"IFERROR(IFERROR(VLOOKUP(B25,'[1]Din Rep'!$B:$M,11,0),VLOOKUP(C25,'[1]Din Rep'!$C:$M,10,0)),\"\")","v":0},{"$f":"IFERROR(IFERROR(VLOOKUP(B25,'[1]Din Rep'!$B:$M,12,0),VLOOKUP(C25,'[1]Din Rep'!$C:$M,11,0)),\"\")","v":"45 DD"}]
[null,"M60933B",{"$f":"IFERROR(VLOOKUP(B26,'[1]Din Rep'!$B:$M,2,0),\"\")","v":"SHORT JOHN MANGA LONGA FRONTZIP 3 MM MASCULINO PRO SUITS 2A MERGULHO MORMAII"},{"$f":"IFERROR(IFERROR(VLOOKUP(B26,'[1]Din Rep'!$B:$M,5,0),VLOOKUP(C26,'[1]Din Rep'!$C:$M,4,0)),\"\")","v":271.62004999999999},{"$f":"IFERROR(IFERROR(VLOOKUP(B26,'[1]Din Rep'!$B:$M,7,0),VLOOKUP(C26,'[1]Din Rep'!$C:$M,6,0)),\"\")","v":288.95749999999998},{"$f":"IFERROR(IFERROR(VLOOKUP(B26,'[1]Din Rep'!$B:$M,8,0),VLOOKUP(C26,'[1]Din Rep'!$C:$M,7,0)),\"\")","v":543.91999999999996},{"$f":"IFERROR(IFERROR(VLOOKUP(B26,'[1]Din Rep'!$B:$M,10,0),VLOOKUP(C26,'[1]Din Rep'!$C:$M,9,0)),\"\")","v":1.8823529411764706},{"$f":"IFERROR(IFERROR(VLOOKUP(B26,'[1]Din Rep'!$B:$M,11,0),VLOOKUP(C26,'[1]Din Rep'!$C:$M,10,0)),\"\")","v":0},{"$f":"IFERROR(IFERROR(VLOOKUP(B26,'[1]Din Rep'!$B:$M,12,0),VLOOKUP(C26,'[1]Din Rep'!$C:$M,11,0)),\"\")","v":"45 DD"}]
[null,"M60953B",{"$f":"IFERROR(VLOOKUP(B27,'[1]Din Rep'!$B:$M,2,0),\"\")","v":"SHORT JOHN MANGA LONGA FRONTZIP 5 MM MASCULINO PRO SUITS 2A MERGULHO MORMAII"},{"$f":"IFERROR(IFERROR(VLOOKUP(B27,'[1]Din Rep'!$B:$M,5,0),VLOOKUP(C27,'[1]Din Rep'!$C:$M,4,0)),\"\")","v":279.61004999999994},{"$f":"IFERROR(IFERROR(VLOOKUP(B27,'[1]Din Rep'!$B:$M,7,0),VLOOKUP(C27,'[1]Din Rep'!$C:$M,6,0)),\"\")","v":297.45749999999998},{"$f":"IFERROR(IFERROR(VLOOKUP(B27,'[1]Din Rep'!$B:$M,8,0),VLOOKUP(C27,'[1]Din Rep'!$C:$M,7,0)),\"\")","v":559.91999999999996},{"$f":"IFERROR(IFERROR(VLOOKUP(B27,'[1]Din Rep'!$B:$M,10,0),VLOOKUP(C27,'[1]Din Rep'!$C:$M,9,0)),\"\")","v":1.8823529411764706},{"$f":"IFERROR(IFERROR(VLOOKUP(B27,'[1]Din Rep'!$B:$M,11,0),VLOOKUP(C27,'[1]Din Rep'!$C:$M,10,0)),\"\")","v":0},{"$f":"IFERROR(IFERROR(VLOOKUP(B27,'[1]Din Rep'!$B:$M,12,0),VLOOKUP(C27,'[1]Din Rep'!$C:$M,11,0)),\"\")","v":"45 DD"}]
[null,"M61132B",{"$f":"IFERROR(VLOOKUP(B28,'[1]Din Rep'!$B:$M,2,0),\"\")","v":"CALÇA 3 MM MASCULINO PRO SUITS 2A MERGULHO MORMAII"},{"$f":"IFERROR(IFERROR(VLOOKUP(B28,'[1]Din Rep'!$B:$M,5,0),VLOOKUP(C28,'[1]Din Rep'!$C:$M,4,0)),\"\")","v":191.72004999999996},{"$f":"IFERROR(IFERROR(VLOOKUP(B28,'[1]Din Rep'!$B:$M,7,0),VLOOKUP(C28,'[1]Din Rep'!$C:$M,6,0)),\"\")","v":203.95749999999998},{"$f":"IFERROR(IFERROR(VLOOKUP(B28,'[1]Din Rep'!$B:$M,8,0),VLOOKUP(C28,'[1]Din Rep'!$C:$M,7,0)),\"\")","v":383.92},{"$f":"IFERROR(IFERROR(VLOOKUP(B28,'[1]Din Rep'!$B:$M,10,0),VLOOKUP(C28,'[1]Din Rep'!$C:$M,9,0)),\"\")","v":1.8823529411764708},{"$f":"IFERROR(IFERROR(VLOOKUP(B28,'[1]Din Rep'!$B:$M,11,0),VLOOKUP(C28,'[1]Din Rep'!$C:$M,10,0)),\"\")","v":0},{"$f":"IFERROR(IFERROR(VLOOKUP(B28,'[1]Din Rep'!$B:$M,12,0),VLOOKUP(C28,'[1]Din Rep'!$C:$M,11,0)),\"\")","v":"45 DD"}]
[null,"M61152B",{"$f":"IFERROR(VLOOKUP(B29,'[1]Din Rep'!$B:$M,2,0),\"\")","v":"CALÇA 5 MM MASCULINO PRO SUITS 2A MERGULHO MORMAII"},{"$f":"IFERROR(IFERROR(VLOOKUP(B29,'[1]Din Rep'!$B:$M,5,0),VLOOKUP(C29,'[1]Din Rep'!$C:$M,4,0)),\"\")","v":199.71004999999997},{"$f":"IFERROR(IFERROR(VLOOKUP(B29,'[1]Din Rep'!$B:$M,7,0),VLOOKUP(C29,'[1]Din Rep'!$C:$M,6,0)),\"\")","v":212.45749999999998},{"$f":"IFERROR(IFERROR(VLOOKUP(B29,'[1]Din Rep'!$B:$M,8,0),VLOOKUP(C29,'[1]Din Rep'!$C:$M,7,0)),\"\")","v":399.92},{"$f":"IFERROR(IFERROR(VLOOKUP(B29,'[1]Din Rep'!$B:$M,10,0),VLOOKUP(C29,'[1]Din Rep'!$C:$M,9,0)),\"\")","v":1.8823529411764708},{"$f":"IFERROR(IFERROR(VLOOKUP(B29,'[1]Din Rep'!$B:$M,11,0),VLOOKUP(C29,'[1]Din Rep'!$C:$M,10,0)),\"\")","v":0},{"$f":"IFERROR(IFERROR(VLOOKUP(B29,'[1]Din Rep'!$B:$M,12,0),VLOOKUP(C29,'[1]Din Rep'!$C:$M,11,0)),\"\")","v":"45 DD"}]
[null,"M61232B",{"$f":"IFERROR(VLOOKUP(B30,'[1]Din Rep'!$B:$M,2,0),\"\")","v":"MACACÃO SEM MANGA SNAP SHOULDER 3 MM MASCULINO PRO SUITS 2A MERGULHO MORMAII"},{"$f":"IFERROR(IFERROR(VLOOKUP(B30,'[1]Din Rep'!$B:$M,5,0),VLOOKUP(C30,'[1]Din Rep'!$C:$M,4,0)),\"\")","v":231.67004999999997},{"$f":"IFERROR(IFERROR(VLOOKUP(B30,'[1]Din Rep'!$B:$M,7,0),VLOOKUP(C30,'[1]Din Rep'!$C:$M,6,0)),\"\")","v":246.45749999999998},{"$f":"IFERROR(IFERROR(VLOOKUP(B30,'[1]Din Rep'!$B:$M,8,0),VLOOKUP(C30,'[1]Din Rep'!$C:$M,7,0)),\"\")","v":463.92},{"$f":"IFERROR(IFERROR(VLOOKUP(B30,'[1]Din Rep'!$B:$M,10,0),VLOOKUP(C30,'[1]Din Rep'!$C:$M,9,0)),\"\")","v":1.8823529411764708},{"$f":"IFERROR(IFERROR(VLOOKUP(B30,'[1]Din Rep'!$B:$M,11,0),VLOOKUP(C30,'[1]Din Rep'!$C:$M,10,0)),\"\")","v":0},{"$f":"IFERROR(IFERROR(VLOOKUP(B30,'[1]Din Rep'!$B:$M,12,0),VLOOKUP(C30,'[1]Din Rep'!$C:$M,11,0)),\"\")","v":"45 DD"}]
[null,"M61252B",{"$f":"IFERROR(VLOOKUP(B31,'[1]Din Rep'!$B:$M,2,0),\"\")","v":"MACACÃO SEM MANGA SNAP SHOULDER 5 MM MASCULINO PRO SUITS 2A MERGULHO MORMAII"},{"$f":"IFERROR(IFERROR(VLOOKUP(B31,'[1]Din Rep'!$B:$M,5,0),VLOOKUP(C31,'[1]Din Rep'!$C:$M,4,0)),\"\")","v":239.66004999999996},{"$f":"IFERROR(IFERROR(VLOOKUP(B31,'[1]Din Rep'!$B:$M,7,0),VLOOKUP(C31,'[1]Din Rep'!$C:$M,6,0)),\"\")","v":254.95749999999998},{"$f":"IFERROR(IFERROR(VLOOKUP(B31,'[1]Din Rep'!$B:$M,8,0),VLOOKUP(C31,'[1]Din Rep'!$C:$M,7,0)),\"\")","v":479.92},{"$f":"IFERROR(IFERROR(VLOOKUP(B31,'[1]Din Rep'!$B:$M,10,0),VLOOKUP(C31,'[1]Din Rep'!$C:$M,9,0)),\"\")","v":1.8823529411764708},{"$f":"IFERROR(IFERROR(VLOOKUP(B31,'[1]Din Rep'!$B:$M,11,0),VLOOKUP(C31,'[1]Din Rep'!$C:$M,10,0)),\"\")","v":0},{"$f":"IFERROR(IFERROR(VLOOKUP(B31,'[1]Din Rep'!$B:$M,12,0),VLOOKUP(C31,'[1]Din Rep'!$C:$M,11,0)),\"\")","v":"45 DD"}]
[null,"M61332B",{"$f":"IFERROR(VLOOKUP(B32,'[1]Din Rep'!$B:$M,2,0),\"\")","v":"MACACÃO MANGA LONGA FRONTZIP 3 MM MASCULINO PRO SUITS 2A MERGULHO MORMAII"},{"$f":"IFERROR(IFERROR(VLOOKUP(B32,'[1]Din Rep'!$B:$M,5,0),VLOOKUP(C32,'[1]Din Rep'!$C:$M,4,0)),\"\")","v":351.52004999999997},{"$f":"IFERROR(IFERROR(VLOOKUP(B32,'[1]Din Rep'!$B:$M,7,0),VLOOKUP(C32,'[1]Din Rep'!$C:$M,6,0)),\"\")","v":373.95749999999998},{"$f":"IFERROR(IFERROR(VLOOKUP(B32,'[1]Din Rep'!$B:$M,8,0),VLOOKUP(C32,'[1]Din Rep'!$C:$M,7,0)),\"\")","v":703.92000000000007},{"$f":"IFERROR(IFERROR(VLOOKUP(B32,'[1]Din Rep'!$B:$M,10,0),VLOOKUP(C32,'[1]Din Rep'!$C:$M,9,0)),\"\")","v":1.8823529411764708},{"$f":"IFERROR(IFERROR(VLOOKUP(B32,'[1]Din Rep'!$B:$M,11,0),VLOOKUP(C32,'[1]Din Rep'!$C:$M,10,0)),\"\")","v":0},{"$f":"IFERROR(IFERROR(VLOOKUP(B32,'[1]Din Rep'!$B:$M,12,0),VLOOKUP(C32,'[1]Din Rep'!$C:$M,11,0)),\"\")","v":"45 DD"}]
[null,"M61352B",{"$f":"IFERROR(VLOOKUP(B33,'[1]Din Rep'!$B:$M,2,0),\"\")","v":"MACACÃO MANGA LONGA FRONTZIP 5 MM MASCULINO PRO SUITS 2A MERGULHO MORMAII"},{"$f":"IFERROR(IFERROR(VLOOKUP(B33,'[1]Din Rep'!$B:$M,5,0),VLOOKUP(C33,'[1]Din Rep'!$C:$M,4,0)),\"\")","v":359.51004999999998},{"$f":"IFERROR(IFERROR(VLOOKUP(B33,'[1]Din Rep'!$B:$M,7,0),VLOOKUP(C33,'[1]Din Rep'!$C:$M,6,0)),\"\")","v":382.45749999999998},{"$f":"IFERROR(IFERROR(VLOOKUP(B33,'[1]Din Rep'!$B:$M,8,0),VLOOKUP(C33,'[1]Din Rep'!$C:$M,7,0)),\"\")","v":719.92000000000007},{"$f":"IFERROR(IFERROR(VLOOKUP(B33,'[1]Din Rep'!$B:$M,10,0),VLOOKUP(C33,'[1]Din Rep'!$C:$M,9,0)),\"\")","v":1.8823529411764708},{"$f":"IFERROR(IFERROR(VLOOKUP(B33,'[1]Din Rep'!$B:$M,11,0),VLOOKUP(C33,'[1]Din Rep'!$C:$M,10,0)),\"\")","v":0},{"$f":"IFERROR(IFERROR(VLOOKUP(B33,'[1]Din Rep'!$B:$M,12,0),VLOOKUP(C33,'[1]Din Rep'!$C:$M,11,0)),\"\")","v":"45 DD"}]
[null,"M62132",{"$f":"IFERROR(VLOOKUP(B34,'[1]Din Rep'!$B:$M,2,0),\"\")","v":"MEIA TRAMADA DE NEOPRENE 3MM P/ MERGULHO"},{"$f":"IFERROR(IFERROR(VLOOKUP(B34,'[1]Din Rep'!$B:$M,5,0),VLOOKUP(C34,'[1]Din Rep'!$C:$M,4,0)),\"\")","v":26.287099999999995},{"$f":"IFERROR(IFERROR(VLOOKUP(B34,'[1]Din Rep'!$B:$M,7,0),VLOOKUP(C34,'[1]Din Rep'!$C:$M,6,0)),\"\")","v":27.964999999999996},{"$f":"IFERROR(IFERROR(VLOOKUP(B34,'[1]Din Rep'!$B:$M,8,0),VLOOKUP(C34,'[1]Din Rep'!$C:$M,7,0)),\"\")","v":54.9},{"$f":"IFERROR(IFERROR(VLOOKUP(B34,'[1]Din Rep'!$B:$M,10,0),VLOOKUP(C34,'[1]Din Rep'!$C:$M,9,0)),\"\")","v":1.9631682460218132},{"$f":"IFERROR(IFERROR(VLOOKUP(B34,'[1]Din Rep'!$B:$M,11,0),VLOOKUP(C34,'[1]Din Rep'!$C:$M,10,0)),\"\")","v":0},{"$f":"IFERROR(IFERROR(VLOOKUP(B34,'[1]Din Rep'!$B:$M,12,0),VLOOKUP(C34,'[1]Din Rep'!$C:$M,11,0)),\"\")","v":"45 DD"}]
[null,"M62132B",{"$f":"IFERROR(VLOOKUP(B35,'[1]Din Rep'!$B:$M,2,0),\"\")","v":"MEIA BLINDSTITCH 3 MM MASCULINO PRO SUITS 2A MERGULHO MORMAII"},{"$f":"IFERROR(IFERROR(VLOOKUP(B35,'[1]Din Rep'!$B:$M,5,0),VLOOKUP(C35,'[1]Din Rep'!$C:$M,4,0)),\"\")","v":39.870099999999994},{"$f":"IFERROR(IFERROR(VLOOKUP(B35,'[1]Din Rep'!$B:$M,7,0),VLOOKUP(C35,'[1]Din Rep'!$C:$M,6,0)),\"\")","v":42.414999999999999},{"$f":"IFERROR(IFERROR(VLOOKUP(B35,'[1]Din Rep'!$B:$M,8,0),VLOOKUP(C35,'[1]Din Rep'!$C:$M,7,0)),\"\")","v":79.900000000000006},{"$f":"IFERROR(IFERROR(VLOOKUP(B35,'[1]Din Rep'!$B:$M,10,0),VLOOKUP(C35,'[1]Din Rep'!$C:$M,9,0)),\"\")","v":1.8837675350701404},{"$f":"IFERROR(IFERROR(VLOOKUP(B35,'[1]Din Rep'!$B:$M,11,0),VLOOKUP(C35,'[1]Din Rep'!$C:$M,10,0)),\"\")","v":0},{"$f":"IFERROR(IFERROR(VLOOKUP(B35,'[1]Din Rep'!$B:$M,12,0),VLOOKUP(C35,'[1]Din Rep'!$C:$M,11,0)),\"\")","v":"45 DD"}]
[null,"MP300B",{"$f":"IFERROR(VLOOKUP(B36,'[1]Din Rep'!$B:$M,2,0),\"\")","v":"PROTETO DE MÁSCARA 3 MM MASCULINO PRO SUITS MERGULHO MORMAII"},{"$f":"IFERROR(IFERROR(VLOOKUP(B36,'[1]Din Rep'!$B:$M,5,0),VLOOKUP(C36,'[1]Din Rep'!$C:$M,4,0)),\"\")","v":10.93831},{"$f":"IFERROR(IFERROR(VLOOKUP(B36,'[1]Din Rep'!$B:$M,7,0),VLOOKUP(C36,'[1]Din Rep'!$C:$M,6,0)),\"\")","v":11.6365},{"$f":"IFERROR(IFERROR(VLOOKUP(B36,'[1]Din Rep'!$B:$M,8,0),VLOOKUP(C36,'[1]Din Rep'!$C:$M,7,0)),\"\")","v":21.904},{"$f":"IFERROR(IFERROR(VLOOKUP(B36,'[1]Din Rep'!$B:$M,10,0),VLOOKUP(C36,'[1]Din Rep'!$C:$M,9,0)),\"\")","v":1.8823529411764706},{"$f":"IFERROR(IFERROR(VLOOKUP(B36,'[1]Din Rep'!$B:$M,11,0),VLOOKUP(C36,'[1]Din Rep'!$C:$M,10,0)),\"\")","v":0},{"$f":"IFERROR(IFERROR(VLOOKUP(B36,'[1]Din Rep'!$B:$M,12,0),VLOOKUP(C36,'[1]Din Rep'!$C:$M,11,0)),\"\")","v":"45 DD"}]
[null,"S033",{"$f":"IFERROR(VLOOKUP(B37,'[1]Din Rep'!$B:$M,2,0),\"\")","v":"MEIA DE NEOPRENE 2MM P/BODY BOARD  (Sob encomenda)"},{"$f":"IFERROR(IFERROR(VLOOKUP(B37,'[1]Din Rep'!$B:$M,5,0),VLOOKUP(C37,'[1]Din Rep'!$C:$M,4,0)),\"\")","v":22.332049999999999},{"$f":"IFERROR(IFERROR(VLOOKUP(B37,'[1]Din Rep'!$B:$M,7,0),VLOOKUP(C37,'[1]Din Rep'!$C:$M,6,0)),\"\")","v":23.7575},{"$f":"IFERROR(IFERROR(VLOOKUP(B37,'[1]Din Rep'!$B:$M,8,0),VLOOKUP(C37,'[1]Din Rep'!$C:$M,7,0)),\"\")","v":55.9},{"$f":"IFERROR(IFERROR(VLOOKUP(B37,'[1]Din Rep'!$B:$M,10,0),VLOOKUP(C37,'[1]Din Rep'!$C:$M,9,0)),\"\")","v":2.3529411764705883},{"$f":"IFERROR(IFERROR(VLOOKUP(B37,'[1]Din Rep'!$B:$M,11,0),VLOOKUP(C37,'[1]Din Rep'!$C:$M,10,0)),\"\")","v":0},{"$f":"IFERROR(IFERROR(VLOOKUP(B37,'[1]Din Rep'!$B:$M,12,0),VLOOKUP(C37,'[1]Din Rep'!$C:$M,11,0)),\"\")","v":"45 DD"}]
["5 - CAÇA/PESCA","C001M",{"$f":"IFERROR(VLOOKUP(B38,'[1]Din Rep'!$B:$M,2,0),\"\")","v":"MACACAO PARA CAÇA E PESCA 4 MM"},{"$f":"IFERROR(IFERROR(VLOOKUP(B38,'[1]Din Rep'!$B:$M,5,0),VLOOKUP(C38,'[1]Din Rep'!$C:$M,4,0)),\"\")","v":442.64599999999996},{"$f":"IFERROR(IFERROR(VLOOKUP(B38,'[1]Din Rep'!$B:$M,7,0),VLOOKUP(C38,'[1]Din Rep'!$C:$M,6,0)),\"\")","v":470.9},{"$f":"IFERROR(IFERROR(VLOOKUP(B38,'[1]Din Rep'!$B:$M,8,0),VLOOKUP(C38,'[1]Din Rep'!$C:$M,7,0)),\"\")","v":"R$ 886,90 - R$ 1108,00 "},{"$f":"IFERROR(IFERROR(VLOOKUP(B38,'[1]Din Rep'!$B:$M,10,0),VLOOKUP(C38,'[1]Din Rep'!$C:$M,9,0)),\"\")","v":"1,88 - 2,35"},{"$f":"IFERROR(IFERROR(VLOOKUP(B38,'[1]Din Rep'!$B:$M,11,0),VLOOKUP(C38,'[1]Din Rep'!$C:$M,10,0)),\"\")","v":0},{"$f":"IFERROR(IFERROR(VLOOKUP(B38,'[1]Din Rep'!$B:$M,12,0),VLOOKUP(C38,'[1]Din Rep'!$C:$M,11,0)),\"\")","v":"45 DD"}]

{"sheet":"TRIATHLON","index":5,"n_rows":14,"n_cols":9,"rows_kept":14,"cut":false,"hidden":false,"merged":[[6,0,7,0],[8,0,9,0],[10,0,11,0],[12,0,13,0]]}
[]
[]
[]
[]
[]
["LINHA","REFERENCIA","DESCRIÇÃO","À VISTA","À PRAZO","SUGESTÃO","MARK UP","IPI","ENTREGA"]
["1 - MASCULINO ÁGUAS ABERTAS 3,1 MM","AA001M31THT4A",{"$f":"IFERROR(VLOOKUP(B7,'[1]Din Rep'!$B:$M,2,0),\"\")","v":"LONG JOHN MANGA LONGA BACKZIP 3/1MM MASCULINO TRIATHLON 4A ÁGUAS ABERTAS MORMAII"},{"$f":"IFERROR(IFERROR(VLOOKUP(B7,'[1]Din Rep'!$B:$M,5,0),VLOOKUP(C7,'[1]Din Rep'!$C:$M,4,0)),\"\")","v":600.88435449999997},{"$f":"IFERROR(IFERROR(VLOOKUP(B7,'[1]Din Rep'!$B:$M,7,0),VLOOKUP(C7,'[1]Din Rep'!$C:$M,6,0)),\"\")","v":639.23867500000006},{"$f":"IFERROR(IFERROR(VLOOKUP(B7,'[1]Din Rep'!$B:$M,8,0),VLOOKUP(C7,'[1]Din Rep'!$C:$M,7,0)),\"\")","v":1504.9},{"$f":"IFERROR(IFERROR(VLOOKUP(B7,'[1]Din Rep'!$B:$M,10,0),VLOOKUP(C7,'[1]Din Rep'!$C:$M,9,0)),\"\")","v":2.354206744452688},{"$f":"IFERROR(IFERROR(VLOOKUP(B7,'[1]Din Rep'!$B:$M,11,0),VLOOKUP(C7,'[1]Din Rep'!$C:$M,10,0)),\"\")","v":0},{"$f":"IFERROR(IFERROR(VLOOKUP(B7,'[1]Din Rep'!$B:$M,12,0),VLOOKUP(C7,'[1]Din Rep'!$C:$M,11,0)),\"\")","v":"45 DD"}]
[null,"AA004M31THT4A",{"$f":"IFERROR(VLOOKUP(B8,'[1]Din Rep'!$B:$M,2,0),\"\")","v":"LONG JOHN SEM MANGA BACKZIP 3/1MM MASCULINO TRIATHLON 4A ÁGUAS ABERTAS MORMAII"},{"$f":"IFERROR(IFERROR(VLOOKUP(B8,'[1]Din Rep'!$B:$M,5,0),VLOOKUP(C8,'[1]Din Rep'!$C:$M,4,0)),\"\")","v":513.79335450000008},{"$f":"IFERROR(IFERROR(VLOOKUP(B8,'[1]Din Rep'!$B:$M,7,0),VLOOKUP(C8,'[1]Din Rep'!$C:$M,6,0)),\"\")","v":546.58867500000008},{"$f":"IFERROR(IFERROR(VLOOKUP(B8,'[1]Din Rep'!$B:$M,8,0),VLOOKUP(C8,'[1]Din Rep'!$C:$M,7,0)),\"\")","v":1289.9000000000001},{"$f":"IFERROR(IFERROR(VLOOKUP(B8,'[1]Din Rep'!$B:$M,10,0),VLOOKUP(C8,'[1]Din Rep'!$C:$M,9,0)),\"\")","v":2.3599098536024368},{"$f":"IFERROR(IFERROR(VLOOKUP(B8,'[1]Din Rep'!$B:$M,11,0),VLOOKUP(C8,'[1]Din Rep'!$C:$M,10,0)),\"\")","v":0},{"$f":"IFERROR(IFERROR(VLOOKUP(B8,'[1]Din Rep'!$B:$M,12,0),VLOOKUP(C8,'[1]Din Rep'!$C:$M,11,0)),\"\")","v":"45 DD"}]
["2 - FEMININO ÁGUAS ABERTAS 3,1 MM","AA001F31THT4A",{"$f":"IFERROR(VLOOKUP(B9,'[1]Din Rep'!$B:$M,2,0),\"\")","v":"LONG JOHN MANGA LONGA BACKZIP 3/1MM FEMININO TRIATHLON 4A ÁGUAS ABERTAS MORMAII"},{"$f":"IFERROR(IFERROR(VLOOKUP(B9,'[1]Din Rep'!$B:$M,5,0),VLOOKUP(C9,'[1]Din Rep'!$C:$M,4,0)),\"\")","v":592.17525450000005},{"$f":"IFERROR(IFERROR(VLOOKUP(B9,'[1]Din Rep'!$B:$M,7,0),VLOOKUP(C9,'[1]Din Rep'!$C:$M,6,0)),\"\")","v":629.97367500000007},{"$f":"IFERROR(IFERROR(VLOOKUP(B9,'[1]Din Rep'!$B:$M,8,0),VLOOKUP(C9,'[1]Din Rep'!$C:$M,7,0)),\"\")","v":1482.9},{"$f":"IFERROR(IFERROR(VLOOKUP(B9,'[1]Din Rep'!$B:$M,10,0),VLOOKUP(C9,'[1]Din Rep'!$C:$M,9,0)),\"\")","v":2.3539078835317997},{"$f":"IFERROR(IFERROR(VLOOKUP(B9,'[1]Din Rep'!$B:$M,11,0),VLOOKUP(C9,'[1]Din Rep'!$C:$M,10,0)),\"\")","v":0},{"$f":"IFERROR(IFERROR(VLOOKUP(B9,'[1]Din Rep'!$B:$M,12,0),VLOOKUP(C9,'[1]Din Rep'!$C:$M,11,0)),\"\")","v":"45 DD"}]
[null,"AA004F31THT4A",{"$f":"IFERROR(VLOOKUP(B10,'[1]Din Rep'!$B:$M,2,0),\"\")","v":"LONG JOHN SEM MANGA BACKZIP 3/1MM FEMININO TRIATHLON 4A ÁGUAS ABERTAS MORMAII"},{"$f":"IFERROR(IFERROR(VLOOKUP(B10,'[1]Din Rep'!$B:$M,5,0),VLOOKUP(C10,'[1]Din Rep'!$C:$M,4,0)),\"\")","v":492.02060450000005},{"$f":"IFERROR(IFERROR(VLOOKUP(B10,'[1]Din Rep'!$B:$M,7,0),VLOOKUP(C10,'[1]Din Rep'!$C:$M,6,0)),\"\")","v":523.42617500000006},{"$f":"IFERROR(IFERROR(VLOOKUP(B10,'[1]Din Rep'!$B:$M,8,0),VLOOKUP(C10,'[1]Din Rep'!$C:$M,7,0)),\"\")","v":1231.9000000000001},{"$f":"IFERROR(IFERROR(VLOOKUP(B10,'[1]Din Rep'!$B:$M,10,0),VLOOKUP(C10,'[1]Din Rep'!$C:$M,9,0)),\"\")","v":2.3535315176013123},{"$f":"IFERROR(IFERROR(VLOOKUP(B10,'[1]Din Rep'!$B:$M,11,0),VLOOKUP(C10,'[1]Din Rep'!$C:$M,10,0)),\"\")","v":0},{"$f":"IFERROR(IFERROR(VLOOKUP(B10,'[1]Din Rep'!$B:$M,12,0),VLOOKUP(C10,'[1]Din Rep'!$C:$M,11,0)),\"\")","v":"45 DD"}]
["3 - MASCULINO ÁGUAS ABERTAS 2 MM","AA053M20THT4A",{"$f":"IFERROR(VLOOKUP(B11,'[1]Din Rep'!$B:$M,2,0),\"\")","v":"CALÇA  2MM MASCULINO TRIATHLON 4A ÁGUAS ABERTAS MORMAII"},{"$f":"IFERROR(IFERROR(VLOOKUP(B11,'[1]Din Rep'!$B:$M,5,0),VLOOKUP(C11,'[1]Din Rep'!$C:$M,4,0)),\"\")","v":195.9112045},{"$f":"IFERROR(IFERROR(VLOOKUP(B11,'[1]Din Rep'!$B:$M,7,0),VLOOKUP(C11,'[1]Din Rep'!$C:$M,6,0)),\"\")","v":208.41617500000001},{"$f":"IFERROR(IFERROR(VLOOKUP(B11,'[1]Din Rep'!$B:$M,8,0),VLOOKUP(C11,'[1]Din Rep'!$C:$M,7,0)),\"\")","v":490.9},{"$f":"IFERROR(IFERROR(VLOOKUP(B11,'[1]Din Rep'!$B:$M,10,0),VLOOKUP(C11,'[1]Din Rep'!$C:$M,9,0)),\"\")","v":2.3553834053426992},{"$f":"IFERROR(IFERROR(VLOOKUP(B11,'[1]Din Rep'!$B:$M,11,0),VLOOKUP(C11,'[1]Din Rep'!$C:$M,10,0)),\"\")","v":0},{"$f":"IFERROR(IFERROR(VLOOKUP(B11,'[1]Din Rep'!$B:$M,12,0),VLOOKUP(C11,'[1]Din Rep'!$C:$M,11,0)),\"\")","v":"45 DD"}]
[null,"AA054M20THT4A",{"$f":"IFERROR(VLOOKUP(B12,'[1]Din Rep'!$B:$M,2,0),\"\")","v":"BERMUDA 2MM MASCULINO TRIATHLON 4A ÁGUAS ABERTAS MORMAII"},{"$f":"IFERROR(IFERROR(VLOOKUP(B12,'[1]Din Rep'!$B:$M,5,0),VLOOKUP(C12,'[1]Din Rep'!$C:$M,4,0)),\"\")","v":134.55559499999998},{"$f":"IFERROR(IFERROR(VLOOKUP(B12,'[1]Din Rep'!$B:$M,7,0),VLOOKUP(C12,'[1]Din Rep'!$C:$M,6,0)),\"\")","v":143.14425},{"$f":"IFERROR(IFERROR(VLOOKUP(B12,'[1]Din Rep'!$B:$M,8,0),VLOOKUP(C12,'[1]Din Rep'!$C:$M,7,0)),\"\")","v":336.9},{"$f":"IFERROR(IFERROR(VLOOKUP(B12,'[1]Din Rep'!$B:$M,10,0),VLOOKUP(C12,'[1]Din Rep'!$C:$M,9,0)),\"\")","v":2.3535699128676142},{"$f":"IFERROR(IFERROR(VLOOKUP(B12,'[1]Din Rep'!$B:$M,11,0),VLOOKUP(C12,'[1]Din Rep'!$C:$M,10,0)),\"\")","v":0},{"$f":"IFERROR(IFERROR(VLOOKUP(B12,'[1]Din Rep'!$B:$M,12,0),VLOOKUP(C12,'[1]Din Rep'!$C:$M,11,0)),\"\")","v":"45 DD"}]
["4 - FEMININO ÁGUAS ABERTAS 2 MM","AA053F20THT4A",{"$f":"IFERROR(VLOOKUP(B13,'[1]Din Rep'!$B:$M,2,0),\"\")","v":"CALÇA 2MM FEMININO TRIATHLON 4A  ÁGUAS ABERTAS MORMAII"},{"$f":"IFERROR(IFERROR(VLOOKUP(B13,'[1]Din Rep'!$B:$M,5,0),VLOOKUP(C13,'[1]Din Rep'!$C:$M,4,0)),\"\")","v":195.9112045},{"$f":"IFERROR(IFERROR(VLOOKUP(B13,'[1]Din Rep'!$B:$M,7,0),VLOOKUP(C13,'[1]Din Rep'!$C:$M,6,0)),\"\")","v":208.41617500000001},{"$f":"IFERROR(IFERROR(VLOOKUP(B13,'[1]Din Rep'!$B:$M,8,0),VLOOKUP(C13,'[1]Din Rep'!$C:$M,7,0)),\"\")","v":490.9},{"$f":"IFERROR(IFERROR(VLOOKUP(B13,'[1]Din Rep'!$B:$M,10,0),VLOOKUP(C13,'[1]Din Rep'!$C:$M,9,0)),\"\")","v":2.3553834053426992},{"$f":"IFERROR(IFERROR(VLOOKUP(B13,'[1]Din Rep'!$B:$M,11,0),VLOOKUP(C13,'[1]Din Rep'!$C:$M,10,0)),\"\")","v":0},{"$f":"IFERROR(IFERROR(VLOOKUP(B13,'[1]Din Rep'!$B:$M,12,0),VLOOKUP(C13,'[1]Din Rep'!$C:$M,11,0)),\"\")","v":"45 DD"}]
[null,"AA054F20THT4A",{"$f":"IFERROR(VLOOKUP(B14,'[1]Din Rep'!$B:$M,2,0),\"\")","v":"BERMUDA 2MM FEMININO TRIATHLON 4A ÁGUAS ABERTAS MORMAII"},{"$f":"IFERROR(IFERROR(VLOOKUP(B14,'[1]Din Rep'!$B:$M,5,0),VLOOKUP(C14,'[1]Din Rep'!$C:$M,4,0)),\"\")","v":134.55559499999998},{"$f":"IFERROR(IFERROR(VLOOKUP(B14,'[1]Din Rep'!$B:$M,7,0),VLOOKUP(C14,'[1]Din Rep'!$C:$M,6,0)),\"\")","v":143.14425},{"$f":"IFERROR(IFERROR(VLOOKUP(B14,'[1]Din Rep'!$B:$M,8,0),VLOOKUP(C14,'[1]Din Rep'!$C:$M,7,0)),\"\")","v":336.9},{"$f":"IFERROR(IFERROR(VLOOKUP(B14,'[1]Din Rep'!$B:$M,10,0),VLOOKUP(C14,'[1]Din Rep'!$C:$M,9,0)),\"\")","v":2.3535699128676142},{"$f":"IFERROR(IFERROR(VLOOKUP(B14,'[1]Din Rep'!$B:$M,11,0),VLOOKUP(C14,'[1]Din Rep'!$C:$M,10,0)),\"\")","v":0},{"$f":"IFERROR(IFERROR(VLOOKUP(B14,'[1]Din Rep'!$B:$M,12,0),VLOOKUP(C14,'[1]Din Rep'!$C:$M,11,0)),\"\")","v":"45 DD"}]

{"sheet":"COLETE","index":6,"n_rows":30,"n_cols":9,"rows_kept":30,"cut":false,"hidden":false,"merged":[[6,0,10,0],[11,0,15,0],[16,0,20,0],[21,0,24,0],[25,0,28,0]]}
[]
[]
[]
[]
[]
["LINHA","REFERENCIA","DESCRIÇÃO","À VISTA","À PRAZO","SUGESTÃO","MARK UP","IPI","ENTREGA"]
["1 - COLETES HOMOLOGADO LINHA TOP","S001WBN3",{"$f":"IFERROR(VLOOKUP(B7,'[1]Din Rep'!$B:$M,2,0),\"\")","v":"COLETE SALVA-VIDAS CLASSE V - COM ZIPPER"},{"$f":"IFERROR(IFERROR(VLOOKUP(B7,'[1]Din Rep'!$B:$M,5,0),VLOOKUP(C7,'[1]Din Rep'!$C:$M,4,0)),\"\")","v":183.76999999999998},{"$f":"IFERROR(IFERROR(VLOOKUP(B7,'[1]Din Rep'!$B:$M,7,0),VLOOKUP(C7,'[1]Din Rep'!$C:$M,6,0)),\"\")","v":195.5},{"$f":"IFERROR(IFERROR(VLOOKUP(B7,'[1]Din Rep'!$B:$M,8,0),VLOOKUP(C7,'[1]Din Rep'!$C:$M,7,0)),\"\")","v":460},{"$f":"IFERROR(IFERROR(VLOOKUP(B7,'[1]Din Rep'!$B:$M,10,0),VLOOKUP(C7,'[1]Din Rep'!$C:$M,9,0)),\"\")","v":2.3529411764705883},{"$f":"IFERROR(IFERROR(VLOOKUP(B7,'[1]Din Rep'!$B:$M,11,0),VLOOKUP(C7,'[1]Din Rep'!$C:$M,10,0)),\"\")","v":0},{"$f":"IFERROR(IFERROR(VLOOKUP(B7,'[1]Din Rep'!$B:$M,12,0),VLOOKUP(C7,'[1]Din Rep'!$C:$M,11,0)),\"\")","v":"45 DD"}]
[null,"S001WBNG3",{"$f":"IFERROR(VLOOKUP(B8,'[1]Din Rep'!$B:$M,2,0),\"\")","v":"COLETE SALVA-VIDAS CLASSE V - COM ZIPPER"},{"$f":"IFERROR(IFERROR(VLOOKUP(B8,'[1]Din Rep'!$B:$M,5,0),VLOOKUP(C8,'[1]Din Rep'!$C:$M,4,0)),\"\")","v":183.76999999999998},{"$f":"IFERROR(IFERROR(VLOOKUP(B8,'[1]Din Rep'!$B:$M,7,0),VLOOKUP(C8,'[1]Din Rep'!$C:$M,6,0)),\"\")","v":195.5},{"$f":"IFERROR(IFERROR(VLOOKUP(B8,'[1]Din Rep'!$B:$M,8,0),VLOOKUP(C8,'[1]Din Rep'!$C:$M,7,0)),\"\")","v":460},{"$f":"IFERROR(IFERROR(VLOOKUP(B8,'[1]Din Rep'!$B:$M,10,0),VLOOKUP(C8,'[1]Din Rep'!$C:$M,9,0)),\"\")","v":2.3529411764705883},{"$f":"IFERROR(IFERROR(VLOOKUP(B8,'[1]Din Rep'!$B:$M,11,0),VLOOKUP(C8,'[1]Din Rep'!$C:$M,10,0)),\"\")","v":0},{"$f":"IFERROR(IFERROR(VLOOKUP(B8,'[1]Din Rep'!$B:$M,12,0),VLOOKUP(C8,'[1]Din Rep'!$C:$M,11,0)),\"\")","v":"45 DD"}]
[null,"S001WBNM3",{"$f":"IFERROR(VLOOKUP(B9,'[1]Din Rep'!$B:$M,2,0),\"\")","v":"COLETE SALVA-VIDAS CLASSE V - COM ZIPPER"},{"$f":"IFERROR(IFERROR(VLOOKUP(B9,'[1]Din Rep'!$B:$M,5,0),VLOOKUP(C9,'[1]Din Rep'!$C:$M,4,0)),\"\")","v":183.76999999999998},{"$f":"IFERROR(IFERROR(VLOOKUP(B9,'[1]Din Rep'!$B:$M,7,0),VLOOKUP(C9,'[1]Din Rep'!$C:$M,6,0)),\"\")","v":195.5},{"$f":"IFERROR(IFERROR(VLOOKUP(B9,'[1]Din Rep'!$B:$M,8,0),VLOOKUP(C9,'[1]Din Rep'!$C:$M,7,0)),\"\")","v":460},{"$f":"IFERROR(IFERROR(VLOOKUP(B9,'[1]Din Rep'!$B:$M,10,0),VLOOKUP(C9,'[1]Din Rep'!$C:$M,9,0)),\"\")","v":2.3529411764705883},{"$f":"IFERROR(IFERROR(VLOOKUP(B9,'[1]Din Rep'!$B:$M,11,0),VLOOKUP(C9,'[1]Din Rep'!$C:$M,10,0)),\"\")","v":0},{"$f":"IFERROR(IFERROR(VLOOKUP(B9,'[1]Din Rep'!$B:$M,12,0),VLOOKUP(C9,'[1]Din Rep'!$C:$M,11,0)),\"\")","v":"45 DD"}]
[null,"S001WBNXG3",{"$f":"IFERROR(VLOOKUP(B10,'[1]Din Rep'!$B:$M,2,0),\"\")","v":"COLETE SALVA-VIDAS CLASSE V - COM ZIPPER"},{"$f":"IFERROR(IFERROR(VLOOKUP(B10,'[1]Din Rep'!$B:$M,5,0),VLOOKUP(C10,'[1]Din Rep'!$C:$M,4,0)),\"\")","v":183.76999999999998},{"$f":"IFERROR(IFERROR(VLOOKUP(B10,'[1]Din Rep'!$B:$M,7,0),VLOOKUP(C10,'[1]Din Rep'!$C:$M,6,0)),\"\")","v":195.5},{"$f":"IFERROR(IFERROR(VLOOKUP(B10,'[1]Din Rep'!$B:$M,8,0),VLOOKUP(C10,'[1]Din Rep'!$C:$M,7,0)),\"\")","v":460},{"$f":"IFERROR(IFERROR(VLOOKUP(B10,'[1]Din Rep'!$B:$M,10,0),VLOOKUP(C10,'[1]Din Rep'!$C:$M,9,0)),\"\")","v":2.3529411764705883},{"$f":"IFERROR(IFERROR(VLOOKUP(B10,'[1]Din Rep'!$B:$M,11,0),VLOOKUP(C10,'[1]Din Rep'!$C:$M,10,0)),\"\")","v":0},{"$f":"IFERROR(IFERROR(VLOOKUP(B10,'[1]Din Rep'!$B:$M,12,0),VLOOKUP(C10,'[1]Din Rep'!$C:$M,11,0)),\"\")","v":"45 DD"}]
[null,"S001WBNXXG3",{"$f":"IFERROR(VLOOKUP(B11,'[1]Din Rep'!$B:$M,2,0),\"\")","v":"COLETE SALVA-VIDAS CLASSE V - COM ZIPPER"},{"$f":"IFERROR(IFERROR(VLOOKUP(B11,'[1]Din Rep'!$B:$M,5,0),VLOOKUP(C11,'[1]Din Rep'!$C:$M,4,0)),\"\")","v":183.76999999999998},{"$f":"IFERROR(IFERROR(VLOOKUP(B11,'[1]Din Rep'!$B:$M,7,0),VLOOKUP(C11,'[1]Din Rep'!$C:$M,6,0)),\"\")","v":195.5},{"$f":"IFERROR(IFERROR(VLOOKUP(B11,'[1]Din Rep'!$B:$M,8,0),VLOOKUP(C11,'[1]Din Rep'!$C:$M,7,0)),\"\")","v":460},{"$f":"IFERROR(IFERROR(VLOOKUP(B11,'[1]Din Rep'!$B:$M,10,0),VLOOKUP(C11,'[1]Din Rep'!$C:$M,9,0)),\"\")","v":2.3529411764705883},{"$f":"IFERROR(IFERROR(VLOOKUP(B11,'[1]Din Rep'!$B:$M,11,0),VLOOKUP(C11,'[1]Din Rep'!$C:$M,10,0)),\"\")","v":0},{"$f":"IFERROR(IFERROR(VLOOKUP(B11,'[1]Din Rep'!$B:$M,12,0),VLOOKUP(C11,'[1]Din Rep'!$C:$M,11,0)),\"\")","v":"45 DD"}]
["2 - COLETES HOMOLOGADO LINHA INTERMEDIÁRIA","S001EN2",{"$f":"IFERROR(VLOOKUP(B12,'[1]Din Rep'!$B:$M,2,0),\"\")","v":"COLETE SALVA VIDAS CLASSE V - SEM ZIPPER"},{"$f":"IFERROR(IFERROR(VLOOKUP(B12,'[1]Din Rep'!$B:$M,5,0),VLOOKUP(C12,'[1]Din Rep'!$C:$M,4,0)),\"\")","v":151.011},{"$f":"IFERROR(IFERROR(VLOOKUP(B12,'[1]Din Rep'!$B:$M,7,0),VLOOKUP(C12,'[1]Din Rep'!$C:$M,6,0)),\"\")","v":160.65},{"$f":"IFERROR(IFERROR(VLOOKUP(B12,'[1]Din Rep'!$B:$M,8,0),VLOOKUP(C12,'[1]Din Rep'!$C:$M,7,0)),\"\")","v":378},{"$f":"IFERROR(IFERROR(VLOOKUP(B12,'[1]Din Rep'!$B:$M,10,0),VLOOKUP(C12,'[1]Din Rep'!$C:$M,9,0)),\"\")","v":2.3529411764705883},{"$f":"IFERROR(IFERROR(VLOOKUP(B12,'[1]Din Rep'!$B:$M,11,0),VLOOKUP(C12,'[1]Din Rep'!$C:$M,10,0)),\"\")","v":0},{"$f":"IFERROR(IFERROR(VLOOKUP(B12,'[1]Din Rep'!$B:$M,12,0),VLOOKUP(C12,'[1]Din Rep'!$C:$M,11,0)),\"\")","v":"45 DD"}]
[null,"S001ENG2",{"$f":"IFERROR(VLOOKUP(B13,'[1]Din Rep'!$B:$M,2,0),\"\")","v":"COLETE SALVA VIDAS CLASSE V - SEM ZIPPER"},{"$f":"IFERROR(IFERROR(VLOOKUP(B13,'[1]Din Rep'!$B:$M,5,0),VLOOKUP(C13,'[1]Din Rep'!$C:$M,4,0)),\"\")","v":151.011},{"$f":"IFERROR(IFERROR(VLOOKUP(B13,'[1]Din Rep'!$B:$M,7,0),VLOOKUP(C13,'[1]Din Rep'!$C:$M,6,0)),\"\")","v":160.65},{"$f":"IFERROR(IFERROR(VLOOKUP(B13,'[1]Din Rep'!$B:$M,8,0),VLOOKUP(C13,'[1]Din Rep'!$C:$M,7,0)),\"\")","v":378},{"$f":"IFERROR(IFERROR(VLOOKUP(B13,'[1]Din Rep'!$B:$M,10,0),VLOOKUP(C13,'[1]Din Rep'!$C:$M,9,0)),\"\")","v":2.3529411764705883},{"$f":"IFERROR(IFERROR(VLOOKUP(B13,'[1]Din Rep'!$B:$M,11,0),VLOOKUP(C13,'[1]Din Rep'!$C:$M,10,0)),\"\")","v":0},{"$f":"IFERROR(IFERROR(VLOOKUP(B13,'[1]Din Rep'!$B:$M,12,0),VLOOKUP(C13,'[1]Din Rep'!$C:$M,11,0)),\"\")","v":"45 DD"}]
[null,"S001ENM2",{"$f":"IFERROR(VLOOKUP(B14,'[1]Din Rep'!$B:$M,2,0),\"\")","v":"COLETE SALVA VIDAS CLASSE V - SEM ZIPPER"},{"$f":"IFERROR(IFERROR(VLOOKUP(B14,'[1]Din Rep'!$B:$M,5,0),VLOOKUP(C14,'[1]Din Rep'!$C:$M,4,0)),\"\")","v":151.011},{"$f":"IFERROR(IFERROR(VLOOKUP(B14,'[1]Din Rep'!$B:$M,7,0),VLOOKUP(C14,'[1]Din Rep'!$C:$M,6,0)),\"\")","v":160.65},{"$f":"IFERROR(IFERROR(VLOOKUP(B14,'[1]Din Rep'!$B:$M,8,0),VLOOKUP(C14,'[1]Din Rep'!$C:$M,7,0)),\"\")","v":378},{"$f":"IFERROR(IFERROR(VLOOKUP(B14,'[1]Din Rep'!$B:$M,10,0),VLOOKUP(C14,'[1]Din Rep'!$C:$M,9,0)),\"\")","v":2.3529411764705883},{"$f":"IFERROR(IFERROR(VLOOKUP(B14,'[1]Din Rep'!$B:$M,11,0),VLOOKUP(C14,'[1]Din Rep'!$C:$M,10,0)),\"\")","v":0},{"$f":"IFERROR(IFERROR(VLOOKUP(B14,'[1]Din Rep'!$B:$M,12,0),VLOOKUP(C14,'[1]Din Rep'!$C:$M,11,0)),\"\")","v":"45 DD"}]
[null,"S001ENXG2",{"$f":"IFERROR(VLOOKUP(B15,'[1]Din Rep'!$B:$M,2,0),\"\")","v":"COLETE SALVA VIDAS CLASSE V - SEM ZIPPER"},{"$f":"IFERROR(IFERROR(VLOOKUP(B15,'[1]Din Rep'!$B:$M,5,0),VLOOKUP(C15,'[1]Din Rep'!$C:$M,4,0)),\"\")","v":151.011},{"$f":"IFERROR(IFERROR(VLOOKUP(B15,'[1]Din Rep'!$B:$M,7,0),VLOOKUP(C15,'[1]Din Rep'!$C:$M,6,0)),\"\")","v":160.65},{"$f":"IFERROR(IFERROR(VLOOKUP(B15,'[1]Din Rep'!$B:$M,8,0),VLOOKUP(C15,'[1]Din Rep'!$C:$M,7,0)),\"\")","v":378},{"$f":"IFERROR(IFERROR(VLOOKUP(B15,'[1]Din Rep'!$B:$M,10,0),VLOOKUP(C15,'[1]Din Rep'!$C:$M,9,0)),\"\")","v":2.3529411764705883},{"$f":"IFERROR(IFERROR(VLOOKUP(B15,'[1]Din Rep'!$B:$M,11,0),VLOOKUP(C15,'[1]Din Rep'!$C:$M,10,0)),\"\")","v":0},{"$f":"IFERROR(IFERROR(VLOOKUP(B15,'[1]Din Rep'!$B:$M,12,0),VLOOKUP(C15,'[1]Din Rep'!$C:$M,11,0)),\"\")","v":"45 DD"}]
[null,"S001ENXXG2",{"$f":"IFERROR(VLOOKUP(B16,'[1]Din Rep'!$B:$M,2,0),\"\")","v":"COLETE SALVA VIDAS CLASSE V - SEM ZIPPER"},{"$f":"IFERROR(IFERROR(VLOOKUP(B16,'[1]Din Rep'!$B:$M,5,0),VLOOKUP(C16,'[1]Din Rep'!$C:$M,4,0)),\"\")","v":151.011},{"$f":"IFERROR(IFERROR(VLOOKUP(B16,'[1]Din Rep'!$B:$M,7,0),VLOOKUP(C16,'[1]Din Rep'!$C:$M,6,0)),\"\")","v":160.65},{"$f":"IFERROR(IFERROR(VLOOKUP(B16,'[1]Din Rep'!$B:$M,8,0),VLOOKUP(C16,'[1]Din Rep'!$C:$M,7,0)),\"\")","v":378},{"$f":"IFERROR(IFERROR(VLOOKUP(B16,'[1]Din Rep'!$B:$M,10,0),VLOOKUP(C16,'[1]Din Rep'!$C:$M,9,0)),\"\")","v":2.3529411764705883},{"$f":"IFERROR(IFERROR(VLOOKUP(B16,'[1]Din Rep'!$B:$M,11,0),VLOOKUP(C16,'[1]Din Rep'!$C:$M,10,0)),\"\")","v":0},{"$f":"IFERROR(IFERROR(VLOOKUP(B16,'[1]Din Rep'!$B:$M,12,0),VLOOKUP(C16,'[1]Din Rep'!$C:$M,11,0)),\"\")","v":"45 DD"}]
["3 - COLETES HOMOLOGADO LINHA ECONÔMICA","S001ECO",{"$f":"IFERROR(VLOOKUP(B17,'[1]Din Rep'!$B:$M,2,0),\"\")","v":"COLETE SALVA-VIDAS CLASSE V - COM ZIPPER"},{"$f":"IFERROR(IFERROR(VLOOKUP(B17,'[1]Din Rep'!$B:$M,5,0),VLOOKUP(C17,'[1]Din Rep'!$C:$M,4,0)),\"\")","v":135.75009999999997},{"$f":"IFERROR(IFERROR(VLOOKUP(B17,'[1]Din Rep'!$B:$M,7,0),VLOOKUP(C17,'[1]Din Rep'!$C:$M,6,0)),\"\")","v":144.41499999999999},{"$f":"IFERROR(IFERROR(VLOOKUP(B17,'[1]Din Rep'!$B:$M,8,0),VLOOKUP(C17,'[1]Din Rep'!$C:$M,7,0)),\"\")","v":339.8},{"$f":"IFERROR(IFERROR(VLOOKUP(B17,'[1]Din Rep'!$B:$M,10,0),VLOOKUP(C17,'[1]Din Rep'!$C:$M,9,0)),\"\")","v":2.3529411764705883},{"$f":"IFERROR(IFERROR(VLOOKUP(B17,'[1]Din Rep'!$B:$M,11,0),VLOOKUP(C17,'[1]Din Rep'!$C:$M,10,0)),\"\")","v":0},{"$f":"IFERROR(IFERROR(VLOOKUP(B17,'[1]Din Rep'!$B:$M,12,0),VLOOKUP(C17,'[1]Din Rep'!$C:$M,11,0)),\"\")","v":"45 DD"}]
[null,"S001ECOG",{"$f":"IFERROR(VLOOKUP(B18,'[1]Din Rep'!$B:$M,2,0),\"\")","v":"COLETE SALVA-VIDAS CLASSE V - COM ZIPPER"},{"$f":"IFERROR(IFERROR(VLOOKUP(B18,'[1]Din Rep'!$B:$M,5,0),VLOOKUP(C18,'[1]Din Rep'!$C:$M,4,0)),\"\")","v":135.75009999999997},{"$f":"IFERROR(IFERROR(VLOOKUP(B18,'[1]Din Rep'!$B:$M,7,0),VLOOKUP(C18,'[1]Din Rep'!$C:$M,6,0)),\"\")","v":144.41499999999999},{"$f":"IFERROR(IFERROR(VLOOKUP(B18,'[1]Din Rep'!$B:$M,8,0),VLOOKUP(C18,'[1]Din Rep'!$C:$M,7,0)),\"\")","v":339.8},{"$f":"IFERROR(IFERROR(VLOOKUP(B18,'[1]Din Rep'!$B:$M,10,0),VLOOKUP(C18,'[1]Din Rep'!$C:$M,9,0)),\"\")","v":2.3529411764705883},{"$f":"IFERROR(IFERROR(VLOOKUP(B18,'[1]Din Rep'!$B:$M,11,0),VLOOKUP(C18,'[1]Din Rep'!$C:$M,10,0)),\"\")","v":0},{"$f":"IFERROR(IFERROR(VLOOKUP(B18,'[1]Din Rep'!$B:$M,12,0),VLOOKUP(C18,'[1]Din Rep'!$C:$M,11,0)),\"\")","v":"45 DD"}]
[null,"S001ECOM",{"$f":"IFERROR(VLOOKUP(B19,'[1]Din Rep'!$B:$M,2,0),\"\")","v":"COLETE SALVA-VIDAS CLASSE V - COM ZIPPER"},{"$f":"IFERROR(IFERROR(VLOOKUP(B19,'[1]Din Rep'!$B:$M,5,0),VLOOKUP(C19,'[1]Din Rep'!$C:$M,4,0)),\"\")","v":135.75009999999997},{"$f":"IFERROR(IFERROR(VLOOKUP(B19,'[1]Din Rep'!$B:$M,7,0),VLOOKUP(C19,'[1]Din Rep'!$C:$M,6,0)),\"\")","v":144.41499999999999},{"$f":"IFERROR(IFERROR(VLOOKUP(B19,'[1]Din Rep'!$B:$M,8,0),VLOOKUP(C19,'[1]Din Rep'!$C:$M,7,0)),\"\")","v":339.8},{"$f":"IFERROR(IFERROR(VLOOKUP(B19,'[1]Din Rep'!$B:$M,10,0),VLOOKUP(C19,'[1]Din Rep'!$C:$M,9,0)),\"\")","v":2.3529411764705883},{"$f":"IFERROR(IFERROR(VLOOKUP(B19,'[1]Din Rep'!$B:$M,11,0),VLOOKUP(C19,'[1]Din Rep'!$C:$M,10,0)),\"\")","v":0},{"$f":"IFERROR(IFERROR(VLOOKUP(B19,'[1]Din Rep'!$B:$M,12,0),VLOOKUP(C19,'[1]Din Rep'!$C:$M,11,0)),\"\")","v":"45 DD"}]
[null,"S001ECOXG",{"$f":"IFERROR(VLOOKUP(B20,'[1]Din Rep'!$B:$M,2,0),\"\")","v":"COLETE SALVA-VIDAS CLASSE V - COM ZIPPER"},{"$f":"IFERROR(IFERROR(VLOOKUP(B20,'[1]Din Rep'!$B:$M,5,0),VLOOKUP(C20,'[1]Din Rep'!$C:$M,4,0)),\"\")","v":135.75009999999997},{"$f":"IFERROR(IFERROR(VLOOKUP(B20,'[1]Din Rep'!$B:$M,7,0),VLOOKUP(C20,'[1]Din Rep'!$C:$M,6,0)),\"\")","v":144.41499999999999},{"$f":"IFERROR(IFERROR(VLOOKUP(B20,'[1]Din Rep'!$B:$M,8,0),VLOOKUP(C20,'[1]Din Rep'!$C:$M,7,0)),\"\")","v":339.8},{"$f":"IFERROR(IFERROR(VLOOKUP(B20,'[1]Din Rep'!$B:$M,10,0),VLOOKUP(C20,'[1]Din Rep'!$C:$M,9,0)),\"\")","v":2.3529411764705883},{"$f":"IFERROR(IFERROR(VLOOKUP(B20,'[1]Din Rep'!$B:$M,11,0),VLOOKUP(C20,'[1]Din Rep'!$C:$M,10,0)),\"\")","v":0},{"$f":"IFERROR(IFERROR(VLOOKUP(B20,'[1]Din Rep'!$B:$M,12,0),VLOOKUP(C20,'[1]Din Rep'!$C:$M,11,0)),\"\")","v":"45 DD"}]
[null,"S001ECOXXG",{"$f":"IFERROR(VLOOKUP(B21,'[1]Din Rep'!$B:$M,2,0),\"\")","v":"COLETE SALVA-VIDAS CLASSE V - COM ZIPPER"},{"$f":"IFERROR(IFERROR(VLOOKUP(B21,'[1]Din Rep'!$B:$M,5,0),VLOOKUP(C21,'[1]Din Rep'!$C:$M,4,0)),\"\")","v":135.75009999999997},{"$f":"IFERROR(IFERROR(VLOOKUP(B21,'[1]Din Rep'!$B:$M,7,0),VLOOKUP(C21,'[1]Din Rep'!$C:$M,6,0)),\"\")","v":144.41499999999999},{"$f":"IFERROR(IFERROR(VLOOKUP(B21,'[1]Din Rep'!$B:$M,8,0),VLOOKUP(C21,'[1]Din Rep'!$C:$M,7,0)),\"\")","v":339.8},{"$f":"IFERROR(IFERROR(VLOOKUP(B21,'[1]Din Rep'!$B:$M,10,0),VLOOKUP(C21,'[1]Din Rep'!$C:$M,9,0)),\"\")","v":2.3529411764705883},{"$f":"IFERROR(IFERROR(VLOOKUP(B21,'[1]Din Rep'!$B:$M,11,0),VLOOKUP(C21,'[1]Din Rep'!$C:$M,10,0)),\"\")","v":0},{"$f":"IFERROR(IFERROR(VLOOKUP(B21,'[1]Din Rep'!$B:$M,12,0),VLOOKUP(C21,'[1]Din Rep'!$C:$M,11,0)),\"\")","v":"45 DD"}]
["4 - COLETES UNISSEX LINHA NYLON","S001PSCG",{"$f":"IFERROR(VLOOKUP(B22,'[1]Din Rep'!$B:$M,2,0),\"\")","v":"COLETE SALVA VIDAS CLASSE V-PESCA "},{"$f":"IFERROR(IFERROR(VLOOKUP(B22,'[1]Din Rep'!$B:$M,5,0),VLOOKUP(C22,'[1]Din Rep'!$C:$M,4,0)),\"\")","v":71.870049999999992},{"$f":"IFERROR(IFERROR(VLOOKUP(B22,'[1]Din Rep'!$B:$M,7,0),VLOOKUP(C22,'[1]Din Rep'!$C:$M,6,0)),\"\")","v":76.457499999999996},{"$f":"IFERROR(IFERROR(VLOOKUP(B22,'[1]Din Rep'!$B:$M,8,0),VLOOKUP(C22,'[1]Din Rep'!$C:$M,7,0)),\"\")","v":179.9},{"$f":"IFERROR(IFERROR(VLOOKUP(B22,'[1]Din Rep'!$B:$M,10,0),VLOOKUP(C22,'[1]Din Rep'!$C:$M,9,0)),\"\")","v":2.3529411764705883},{"$f":"IFERROR(IFERROR(VLOOKUP(B22,'[1]Din Rep'!$B:$M,11,0),VLOOKUP(C22,'[1]Din Rep'!$C:$M,10,0)),\"\")","v":0},{"$f":"IFERROR(IFERROR(VLOOKUP(B22,'[1]Din Rep'!$B:$M,12,0),VLOOKUP(C22,'[1]Din Rep'!$C:$M,11,0)),\"\")","v":"45 DD"}]
[null,"S001PSCM",{"$f":"IFERROR(VLOOKUP(B23,'[1]Din Rep'!$B:$M,2,0),\"\")","v":"COLETE SALVA VIDAS CLASSE V-PESCA "},{"$f":"IFERROR(IFERROR(VLOOKUP(B23,'[1]Din Rep'!$B:$M,5,0),VLOOKUP(C23,'[1]Din Rep'!$C:$M,4,0)),\"\")","v":71.870049999999992},{"$f":"IFERROR(IFERROR(VLOOKUP(B23,'[1]Din Rep'!$B:$M,7,0),VLOOKUP(C23,'[1]Din Rep'!$C:$M,6,0)),\"\")","v":76.457499999999996},{"$f":"IFERROR(IFERROR(VLOOKUP(B23,'[1]Din Rep'!$B:$M,8,0),VLOOKUP(C23,'[1]Din Rep'!$C:$M,7,0)),\"\")","v":179.9},{"$f":"IFERROR(IFERROR(VLOOKUP(B23,'[1]Din Rep'!$B:$M,10,0),VLOOKUP(C23,'[1]Din Rep'!$C:$M,9,0)),\"\")","v":2.3529411764705883},{"$f":"IFERROR(IFERROR(VLOOKUP(B23,'[1]Din Rep'!$B:$M,11,0),VLOOKUP(C23,'[1]Din Rep'!$C:$M,10,0)),\"\")","v":0},{"$f":"IFERROR(IFERROR(VLOOKUP(B23,'[1]Din Rep'!$B:$M,12,0),VLOOKUP(C23,'[1]Din Rep'!$C:$M,11,0)),\"\")","v":"45 DD"}]
[null,"S001PSCXG",{"$f":"IFERROR(VLOOKUP(B24,'[1]Din Rep'!$B:$M,2,0),\"\")","v":"COLETE SALVA VIDAS CLASSE V-PESCA "},{"$f":"IFERROR(IFERROR(VLOOKUP(B24,'[1]Din Rep'!$B:$M,5,0),VLOOKUP(C24,'[1]Din Rep'!$C:$M,4,0)),\"\")","v":79.860049999999987},{"$f":"IFERROR(IFERROR(VLOOKUP(B24,'[1]Din Rep'!$B:$M,7,0),VLOOKUP(C24,'[1]Din Rep'!$C:$M,6,0)),\"\")","v":84.957499999999996},{"$f":"IFERROR(IFERROR(VLOOKUP(B24,'[1]Din Rep'!$B:$M,8,0),VLOOKUP(C24,'[1]Din Rep'!$C:$M,7,0)),\"\")","v":199.9},{"$f":"IFERROR(IFERROR(VLOOKUP(B24,'[1]Din Rep'!$B:$M,10,0),VLOOKUP(C24,'[1]Din Rep'!$C:$M,9,0)),\"\")","v":2.3529411764705883},{"$f":"IFERROR(IFERROR(VLOOKUP(B24,'[1]Din Rep'!$B:$M,11,0),VLOOKUP(C24,'[1]Din Rep'!$C:$M,10,0)),\"\")","v":0},{"$f":"IFERROR(IFERROR(VLOOKUP(B24,'[1]Din Rep'!$B:$M,12,0),VLOOKUP(C24,'[1]Din Rep'!$C:$M,11,0)),\"\")","v":"45 DD"}]
[null,"S001PSCXXG",{"$f":"IFERROR(VLOOKUP(B25,'[1]Din Rep'!$B:$M,2,0),\"\")","v":"COLETE SALVA VIDAS CLASSE V-PESCA "},{"$f":"IFERROR(IFERROR(VLOOKUP(B25,'[1]Din Rep'!$B:$M,5,0),VLOOKUP(C25,'[1]Din Rep'!$C:$M,4,0)),\"\")","v":79.860049999999987},{"$f":"IFERROR(IFERROR(VLOOKUP(B25,'[1]Din Rep'!$B:$M,7,0),VLOOKUP(C25,'[1]Din Rep'!$C:$M,6,0)),\"\")","v":84.957499999999996},{"$f":"IFERROR(IFERROR(VLOOKUP(B25,'[1]Din Rep'!$B:$M,8,0),VLOOKUP(C25,'[1]Din Rep'!$C:$M,7,0)),\"\")","v":199.9},{"$f":"IFERROR(IFERROR(VLOOKUP(B25,'[1]Din Rep'!$B:$M,10,0),VLOOKUP(C25,'[1]Din Rep'!$C:$M,9,0)),\"\")","v":2.3529411764705883},{"$f":"IFERROR(IFERROR(VLOOKUP(B25,'[1]Din Rep'!$B:$M,11,0),VLOOKUP(C25,'[1]Din Rep'!$C:$M,10,0)),\"\")","v":0},{"$f":"IFERROR(IFERROR(VLOOKUP(B25,'[1]Din Rep'!$B:$M,12,0),VLOOKUP(C25,'[1]Din Rep'!$C:$M,11,0)),\"\")","v":"45 DD"}]
["5 - COLETES HOMOLOGADO LINHA BABY","S001B2",{"$f":"IFERROR(VLOOKUP(B26,'[1]Din Rep'!$B:$M,2,0),\"\")","v":"COLETE SALVA VIDAS CLASSE V - BABY"},{"$f":"IFERROR(IFERROR(VLOOKUP(B26,'[1]Din Rep'!$B:$M,5,0),VLOOKUP(C26,'[1]Din Rep'!$C:$M,4,0)),\"\")","v":95.8001},{"$f":"IFERROR(IFERROR(VLOOKUP(B26,'[1]Din Rep'!$B:$M,7,0),VLOOKUP(C26,'[1]Din Rep'!$C:$M,6,0)),\"\")","v":101.91500000000001},{"$f":"IFERROR(IFERROR(VLOOKUP(B26,'[1]Din Rep'!$B:$M,8,0),VLOOKUP(C26,'[1]Din Rep'!$C:$M,7,0)),\"\")","v":239.8},{"$f":"IFERROR(IFERROR(VLOOKUP(B26,'[1]Din Rep'!$B:$M,10,0),VLOOKUP(C26,'[1]Din Rep'!$C:$M,9,0)),\"\")","v":2.3529411764705883},{"$f":"IFERROR(IFERROR(VLOOKUP(B26,'[1]Din Rep'!$B:$M,11,0),VLOOKUP(C26,'[1]Din Rep'!$C:$M,10,0)),\"\")","v":0},{"$f":"IFERROR(IFERROR(VLOOKUP(B26,'[1]Din Rep'!$B:$M,12,0),VLOOKUP(C26,'[1]Din Rep'!$C:$M,11,0)),\"\")","v":"45 DD"}]
[null,"S001IB2",{"$f":"IFERROR(VLOOKUP(B27,'[1]Din Rep'!$B:$M,2,0),\"\")","v":"COLETE SALVA VIDAS CLASSE V - 1 A 5 ANOS"},{"$f":"IFERROR(IFERROR(VLOOKUP(B27,'[1]Din Rep'!$B:$M,5,0),VLOOKUP(C27,'[1]Din Rep'!$C:$M,4,0)),\"\")","v":95.8001},{"$f":"IFERROR(IFERROR(VLOOKUP(B27,'[1]Din Rep'!$B:$M,7,0),VLOOKUP(C27,'[1]Din Rep'!$C:$M,6,0)),\"\")","v":101.91500000000001},{"$f":"IFERROR(IFERROR(VLOOKUP(B27,'[1]Din Rep'!$B:$M,8,0),VLOOKUP(C27,'[1]Din Rep'!$C:$M,7,0)),\"\")","v":239.8},{"$f":"IFERROR(IFERROR(VLOOKUP(B27,'[1]Din Rep'!$B:$M,10,0),VLOOKUP(C27,'[1]Din Rep'!$C:$M,9,0)),\"\")","v":2.3529411764705883},{"$f":"IFERROR(IFERROR(VLOOKUP(B27,'[1]Din Rep'!$B:$M,11,0),VLOOKUP(C27,'[1]Din Rep'!$C:$M,10,0)),\"\")","v":0},{"$f":"IFERROR(IFERROR(VLOOKUP(B27,'[1]Din Rep'!$B:$M,12,0),VLOOKUP(C27,'[1]Din Rep'!$C:$M,11,0)),\"\")","v":"45 DD"}]
[null,"S001II2",{"$f":"IFERROR(VLOOKUP(B28,'[1]Din Rep'!$B:$M,2,0),\"\")","v":"COLETE SALVA VIDAS CLASSE V - 5 A8 ANOS"},{"$f":"IFERROR(IFERROR(VLOOKUP(B28,'[1]Din Rep'!$B:$M,5,0),VLOOKUP(C28,'[1]Din Rep'!$C:$M,4,0)),\"\")","v":95.8001},{"$f":"IFERROR(IFERROR(VLOOKUP(B28,'[1]Din Rep'!$B:$M,7,0),VLOOKUP(C28,'[1]Din Rep'!$C:$M,6,0)),\"\")","v":101.91500000000001},{"$f":"IFERROR(IFERROR(VLOOKUP(B28,'[1]Din Rep'!$B:$M,8,0),VLOOKUP(C28,'[1]Din Rep'!$C:$M,7,0)),\"\")","v":239.8},{"$f":"IFERROR(IFERROR(VLOOKUP(B28,'[1]Din Rep'!$B:$M,10,0),VLOOKUP(C28,'[1]Din Rep'!$C:$M,9,0)),\"\")","v":2.3529411764705883},{"$f":"IFERROR(IFERROR(VLOOKUP(B28,'[1]Din Rep'!$B:$M,11,0),VLOOKUP(C28,'[1]Din Rep'!$C:$M,10,0)),\"\")","v":0},{"$f":"IFERROR(IFERROR(VLOOKUP(B28,'[1]Din Rep'!$B:$M,12,0),VLOOKUP(C28,'[1]Din Rep'!$C:$M,11,0)),\"\")","v":"45 DD"}]
[null,"S001III2",{"$f":"IFERROR(VLOOKUP(B29,'[1]Din Rep'!$B:$M,2,0),\"\")","v":"COLETE SALVA VIDAS CLASSE V - 8 A 11 ANOS"},{"$f":"IFERROR(IFERROR(VLOOKUP(B29,'[1]Din Rep'!$B:$M,5,0),VLOOKUP(C29,'[1]Din Rep'!$C:$M,4,0)),\"\")","v":95.8001},{"$f":"IFERROR(IFERROR(VLOOKUP(B29,'[1]Din Rep'!$B:$M,7,0),VLOOKUP(C29,'[1]Din Rep'!$C:$M,6,0)),\"\")","v":101.91500000000001},{"$f":"IFERROR(IFERROR(VLOOKUP(B29,'[1]Din Rep'!$B:$M,8,0),VLOOKUP(C29,'[1]Din Rep'!$C:$M,7,0)),\"\")","v":239.8},{"$f":"IFERROR(IFERROR(VLOOKUP(B29,'[1]Din Rep'!$B:$M,10,0),VLOOKUP(C29,'[1]Din Rep'!$C:$M,9,0)),\"\")","v":2.3529411764705883},{"$f":"IFERROR(IFERROR(VLOOKUP(B29,'[1]Din Rep'!$B:$M,11,0),VLOOKUP(C29,'[1]Din Rep'!$C:$M,10,0)),\"\")","v":0},{"$f":"IFERROR(IFERROR(VLOOKUP(B29,'[1]Din Rep'!$B:$M,12,0),VLOOKUP(C29,'[1]Din Rep'!$C:$M,11,0)),\"\")","v":"45 DD"}]
["6 - COLETE SAIL DE FLUTUAÇÃO","AQ036U15SAI1A",{"$f":"IFERROR(VLOOKUP(B30,'[1]Din Rep'!$B:$M,2,0),\"\")","v":"COLETE DE FLUTUAÇÃO SAIL 1A AQUATICOS MORMAII"},{"$f":"IFERROR(IFERROR(VLOOKUP(B30,'[1]Din Rep'!$B:$M,5,0),VLOOKUP(C30,'[1]Din Rep'!$C:$M,4,0)),\"\")","v":179.73504999999997},{"$f":"IFERROR(IFERROR(VLOOKUP(B30,'[1]Din Rep'!$B:$M,7,0),VLOOKUP(C30,'[1]Din Rep'!$C:$M,6,0)),\"\")","v":191.20749999999998},{"$f":"IFERROR(IFERROR(VLOOKUP(B30,'[1]Din Rep'!$B:$M,8,0),VLOOKUP(C30,'[1]Din Rep'!$C:$M,7,0)),\"\")","v":449.9},{"$f":"IFERROR(IFERROR(VLOOKUP(B30,'[1]Din Rep'!$B:$M,10,0),VLOOKUP(C30,'[1]Din Rep'!$C:$M,9,0)),\"\")","v":2.3529411764705883},{"$f":"IFERROR(IFERROR(VLOOKUP(B30,'[1]Din Rep'!$B:$M,11,0),VLOOKUP(C30,'[1]Din Rep'!$C:$M,10,0)),\"\")","v":0},{"$f":"IFERROR(IFERROR(VLOOKUP(B30,'[1]Din Rep'!$B:$M,12,0),VLOOKUP(C30,'[1]Din Rep'!$C:$M,11,0)),\"\")","v":"45 DD"}]

{"sheet":"ACESSÓRIO","index":7,"n_rows":67,"n_cols":9,"rows_kept":67,"cut":false,"hidden":false,"merged":[[6,0,55,0],[56,0,66,0]]}
[]
[]
[]
[]
[]
["LINHA","REFERENCIA","DESCRIÇÃO","À VISTA","À PRAZO","SUGESTÃO","MARK UP","IPI","ENTREGA"]
["ACESSÓRIOS 2017/18","A091",{"$f":"IFERROR(VLOOKUP(B7,'[1]Din Rep'!$B:$M,2,0),\"\")","v":"POCHETE C/ 2 ZIPERS NEOPRENE - MORMAII"},{"$f":"IFERROR(IFERROR(VLOOKUP(B7,'[1]Din Rep'!$B:$M,5,0),VLOOKUP(C7,'[1]Din Rep'!$C:$M,4,0)),\"\")","v":43.545499999999997},{"$f":"IFERROR(IFERROR(VLOOKUP(B7,'[1]Din Rep'!$B:$M,7,0),VLOOKUP(C7,'[1]Din Rep'!$C:$M,6,0)),\"\")","v":46.325000000000003},{"$f":"IFERROR(IFERROR(VLOOKUP(B7,'[1]Din Rep'!$B:$M,8,0),VLOOKUP(C7,'[1]Din Rep'!$C:$M,7,0)),\"\")","v":119.90000000000002},{"$f":"IFERROR(IFERROR(VLOOKUP(B7,'[1]Din Rep'!$B:$M,10,0),VLOOKUP(C7,'[1]Din Rep'!$C:$M,9,0)),\"\")","v":2.3294117647058825},{"$f":"IFERROR(IFERROR(VLOOKUP(B7,'[1]Din Rep'!$B:$M,11,0),VLOOKUP(C7,'[1]Din Rep'!$C:$M,10,0)),\"\")","v":0.1},{"$f":"IFERROR(IFERROR(VLOOKUP(B7,'[1]Din Rep'!$B:$M,12,0),VLOOKUP(C7,'[1]Din Rep'!$C:$M,11,0)),\"\")","v":"45 DD"}]
[null,"A092",{"$f":"IFERROR(VLOOKUP(B8,'[1]Din Rep'!$B:$M,2,0),\"\")","v":"LIXEIRA DE NEOPRENE P/ CARRO - MORMAII"},{"$f":"IFERROR(IFERROR(VLOOKUP(B8,'[1]Din Rep'!$B:$M,5,0),VLOOKUP(C8,'[1]Din Rep'!$C:$M,4,0)),\"\")","v":10.778509999999999},{"$f":"IFERROR(IFERROR(VLOOKUP(B8,'[1]Din Rep'!$B:$M,7,0),VLOOKUP(C8,'[1]Din Rep'!$C:$M,6,0)),\"\")","v":11.4665},{"$f":"IFERROR(IFERROR(VLOOKUP(B8,'[1]Din Rep'!$B:$M,8,0),VLOOKUP(C8,'[1]Din Rep'!$C:$M,7,0)),\"\")","v":29.678000000000004},{"$f":"IFERROR(IFERROR(VLOOKUP(B8,'[1]Din Rep'!$B:$M,10,0),VLOOKUP(C8,'[1]Din Rep'!$C:$M,9,0)),\"\")","v":2.329411764705883},{"$f":"IFERROR(IFERROR(VLOOKUP(B8,'[1]Din Rep'!$B:$M,11,0),VLOOKUP(C8,'[1]Din Rep'!$C:$M,10,0)),\"\")","v":0.1},{"$f":"IFERROR(IFERROR(VLOOKUP(B8,'[1]Din Rep'!$B:$M,12,0),VLOOKUP(C8,'[1]Din Rep'!$C:$M,11,0)),\"\")","v":"45 DD"}]
[null,"A106",{"$f":"IFERROR(VLOOKUP(B9,'[1]Din Rep'!$B:$M,2,0),\"\")","v":"MOUSE PAD DE NEOPRENE - MORMAII"},{"$f":"IFERROR(IFERROR(VLOOKUP(B9,'[1]Din Rep'!$B:$M,5,0),VLOOKUP(C9,'[1]Din Rep'!$C:$M,4,0)),\"\")","v":7.23095},{"$f":"IFERROR(IFERROR(VLOOKUP(B9,'[1]Din Rep'!$B:$M,7,0),VLOOKUP(C9,'[1]Din Rep'!$C:$M,6,0)),\"\")","v":7.6925000000000008},{"$f":"IFERROR(IFERROR(VLOOKUP(B9,'[1]Din Rep'!$B:$M,8,0),VLOOKUP(C9,'[1]Din Rep'!$C:$M,7,0)),\"\")","v":19.910000000000004},{"$f":"IFERROR(IFERROR(VLOOKUP(B9,'[1]Din Rep'!$B:$M,10,0),VLOOKUP(C9,'[1]Din Rep'!$C:$M,9,0)),\"\")","v":2.3294117647058825},{"$f":"IFERROR(IFERROR(VLOOKUP(B9,'[1]Din Rep'!$B:$M,11,0),VLOOKUP(C9,'[1]Din Rep'!$C:$M,10,0)),\"\")","v":0.1},{"$f":"IFERROR(IFERROR(VLOOKUP(B9,'[1]Din Rep'!$B:$M,12,0),VLOOKUP(C9,'[1]Din Rep'!$C:$M,11,0)),\"\")","v":"45 DD"}]
[null,"A114",{"$f":"IFERROR(VLOOKUP(B10,'[1]Din Rep'!$B:$M,2,0),\"\")","v":"ESTOJO DE NEOPRENE P/ LÁPIS - MORMAII"},{"$f":"IFERROR(IFERROR(VLOOKUP(B10,'[1]Din Rep'!$B:$M,5,0),VLOOKUP(C10,'[1]Din Rep'!$C:$M,4,0)),\"\")","v":9.9795099999999994},{"$f":"IFERROR(IFERROR(VLOOKUP(B10,'[1]Din Rep'!$B:$M,7,0),VLOOKUP(C10,'[1]Din Rep'!$C:$M,6,0)),\"\")","v":10.6165},{"$f":"IFERROR(IFERROR(VLOOKUP(B10,'[1]Din Rep'!$B:$M,8,0),VLOOKUP(C10,'[1]Din Rep'!$C:$M,7,0)),\"\")","v":27.478000000000002},{"$f":"IFERROR(IFERROR(VLOOKUP(B10,'[1]Din Rep'!$B:$M,10,0),VLOOKUP(C10,'[1]Din Rep'!$C:$M,9,0)),\"\")","v":2.3294117647058825},{"$f":"IFERROR(IFERROR(VLOOKUP(B10,'[1]Din Rep'!$B:$M,11,0),VLOOKUP(C10,'[1]Din Rep'!$C:$M,10,0)),\"\")","v":0.1},{"$f":"IFERROR(IFERROR(VLOOKUP(B10,'[1]Din Rep'!$B:$M,12,0),VLOOKUP(C10,'[1]Din Rep'!$C:$M,11,0)),\"\")","v":"45 DD"}]
[null,"A208",{"$f":"IFERROR(VLOOKUP(B11,'[1]Din Rep'!$B:$M,2,0),\"\")","v":"SEGURANÇA DE NEOPRENE P/ OCULOS - MORMAII"},{"$f":"IFERROR(IFERROR(VLOOKUP(B11,'[1]Din Rep'!$B:$M,5,0),VLOOKUP(C11,'[1]Din Rep'!$C:$M,4,0)),\"\")","v":3.6050879999999994},{"$f":"IFERROR(IFERROR(VLOOKUP(B11,'[1]Din Rep'!$B:$M,7,0),VLOOKUP(C11,'[1]Din Rep'!$C:$M,6,0)),\"\")","v":3.8351999999999995},{"$f":"IFERROR(IFERROR(VLOOKUP(B11,'[1]Din Rep'!$B:$M,8,0),VLOOKUP(C11,'[1]Din Rep'!$C:$M,7,0)),\"\")","v":9.9263999999999992},{"$f":"IFERROR(IFERROR(VLOOKUP(B11,'[1]Din Rep'!$B:$M,10,0),VLOOKUP(C11,'[1]Din Rep'!$C:$M,9,0)),\"\")","v":2.3294117647058825},{"$f":"IFERROR(IFERROR(VLOOKUP(B11,'[1]Din Rep'!$B:$M,11,0),VLOOKUP(C11,'[1]Din Rep'!$C:$M,10,0)),\"\")","v":0.1},{"$f":"IFERROR(IFERROR(VLOOKUP(B11,'[1]Din Rep'!$B:$M,12,0),VLOOKUP(C11,'[1]Din Rep'!$C:$M,11,0)),\"\")","v":"45 DD"}]
[null,"A277",{"$f":"IFERROR(VLOOKUP(B12,'[1]Din Rep'!$B:$M,2,0),\"\")","v":"SEGURANÇA FLOATER DE NEOPRENE P/ ÓCULOS - MORMAII"},{"$f":"IFERROR(IFERROR(VLOOKUP(B12,'[1]Din Rep'!$B:$M,5,0),VLOOKUP(C12,'[1]Din Rep'!$C:$M,4,0)),\"\")","v":9.6678999999999995},{"$f":"IFERROR(IFERROR(VLOOKUP(B12,'[1]Din Rep'!$B:$M,7,0),VLOOKUP(C12,'[1]Din Rep'!$C:$M,6,0)),\"\")","v":10.285},{"$f":"IFERROR(IFERROR(VLOOKUP(B12,'[1]Din Rep'!$B:$M,8,0),VLOOKUP(C12,'[1]Din Rep'!$C:$M,7,0)),\"\")","v":26.62},{"$f":"IFERROR(IFERROR(VLOOKUP(B12,'[1]Din Rep'!$B:$M,10,0),VLOOKUP(C12,'[1]Din Rep'!$C:$M,9,0)),\"\")","v":2.3294117647058825},{"$f":"IFERROR(IFERROR(VLOOKUP(B12,'[1]Din Rep'!$B:$M,11,0),VLOOKUP(C12,'[1]Din Rep'!$C:$M,10,0)),\"\")","v":0.1},{"$f":"IFERROR(IFERROR(VLOOKUP(B12,'[1]Din Rep'!$B:$M,12,0),VLOOKUP(C12,'[1]Din Rep'!$C:$M,11,0)),\"\")","v":"45 DD"}]
[null,"A305",{"$f":"IFERROR(VLOOKUP(B13,'[1]Din Rep'!$B:$M,2,0),\"\")","v":"POCHETE C/ 3 ZIPERS NEOPRENE - MORMAII"},{"$f":"IFERROR(IFERROR(VLOOKUP(B13,'[1]Din Rep'!$B:$M,5,0),VLOOKUP(C13,'[1]Din Rep'!$C:$M,4,0)),\"\")","v":51.383689999999994},{"$f":"IFERROR(IFERROR(VLOOKUP(B13,'[1]Din Rep'!$B:$M,7,0),VLOOKUP(C13,'[1]Din Rep'!$C:$M,6,0)),\"\")","v":54.663499999999999},{"$f":"IFERROR(IFERROR(VLOOKUP(B13,'[1]Din Rep'!$B:$M,8,0),VLOOKUP(C13,'[1]Din Rep'!$C:$M,7,0)),\"\")","v":141.48200000000003},{"$f":"IFERROR(IFERROR(VLOOKUP(B13,'[1]Din Rep'!$B:$M,10,0),VLOOKUP(C13,'[1]Din Rep'!$C:$M,9,0)),\"\")","v":2.329411764705883},{"$f":"IFERROR(IFERROR(VLOOKUP(B13,'[1]Din Rep'!$B:$M,11,0),VLOOKUP(C13,'[1]Din Rep'!$C:$M,10,0)),\"\")","v":0.1},{"$f":"IFERROR(IFERROR(VLOOKUP(B13,'[1]Din Rep'!$B:$M,12,0),VLOOKUP(C13,'[1]Din Rep'!$C:$M,11,0)),\"\")","v":"45 DD"}]
[null,"A307",{"$f":"IFERROR(VLOOKUP(B14,'[1]Din Rep'!$B:$M,2,0),\"\")","v":"POCHETE DE NEOPRENE - MORMAII"},{"$f":"IFERROR(IFERROR(VLOOKUP(B14,'[1]Din Rep'!$B:$M,5,0),VLOOKUP(C14,'[1]Din Rep'!$C:$M,4,0)),\"\")","v":36.221146900000008},{"$f":"IFERROR(IFERROR(VLOOKUP(B14,'[1]Din Rep'!$B:$M,7,0),VLOOKUP(C14,'[1]Din Rep'!$C:$M,6,0)),\"\")","v":38.533135000000009},{"$f":"IFERROR(IFERROR(VLOOKUP(B14,'[1]Din Rep'!$B:$M,8,0),VLOOKUP(C14,'[1]Din Rep'!$C:$M,7,0)),\"\")","v":99.732820000000032},{"$f":"IFERROR(IFERROR(VLOOKUP(B14,'[1]Din Rep'!$B:$M,10,0),VLOOKUP(C14,'[1]Din Rep'!$C:$M,9,0)),\"\")","v":2.3294117647058825},{"$f":"IFERROR(IFERROR(VLOOKUP(B14,'[1]Din Rep'!$B:$M,11,0),VLOOKUP(C14,'[1]Din Rep'!$C:$M,10,0)),\"\")","v":0.1},{"$f":"IFERROR(IFERROR(VLOOKUP(B14,'[1]Din Rep'!$B:$M,12,0),VLOOKUP(C14,'[1]Din Rep'!$C:$M,11,0)),\"\")","v":"45 DD"}]
[null,"A364MC",{"$f":"IFERROR(VLOOKUP(B15,'[1]Din Rep'!$B:$M,2,0),\"\")","v":"CARTEIRA DE NEOPRENE BOLSO INTERNO - MORMAII"},{"$f":"IFERROR(IFERROR(VLOOKUP(B15,'[1]Din Rep'!$B:$M,5,0),VLOOKUP(C15,'[1]Din Rep'!$C:$M,4,0)),\"\")","v":11.577509999999998},{"$f":"IFERROR(IFERROR(VLOOKUP(B15,'[1]Din Rep'!$B:$M,7,0),VLOOKUP(C15,'[1]Din Rep'!$C:$M,6,0)),\"\")","v":12.3165},{"$f":"IFERROR(IFERROR(VLOOKUP(B15,'[1]Din Rep'!$B:$M,8,0),VLOOKUP(C15,'[1]Din Rep'!$C:$M,7,0)),\"\")","v":31.878000000000004},{"$f":"IFERROR(IFERROR(VLOOKUP(B15,'[1]Din Rep'!$B:$M,10,0),VLOOKUP(C15,'[1]Din Rep'!$C:$M,9,0)),\"\")","v":2.329411764705883},{"$f":"IFERROR(IFERROR(VLOOKUP(B15,'[1]Din Rep'!$B:$M,11,0),VLOOKUP(C15,'[1]Din Rep'!$C:$M,10,0)),\"\")","v":0.1},{"$f":"IFERROR(IFERROR(VLOOKUP(B15,'[1]Din Rep'!$B:$M,12,0),VLOOKUP(C15,'[1]Din Rep'!$C:$M,11,0)),\"\")","v":"45 DD"}]
[null,"A365MC",{"$f":"IFERROR(VLOOKUP(B16,'[1]Din Rep'!$B:$M,2,0),\"\")","v":"MINI POCHETE INVISIVEL DE NEOPRENE - MORMAII"},{"$f":"IFERROR(IFERROR(VLOOKUP(B16,'[1]Din Rep'!$B:$M,5,0),VLOOKUP(C16,'[1]Din Rep'!$C:$M,4,0)),\"\")","v":14.49386},{"$f":"IFERROR(IFERROR(VLOOKUP(B16,'[1]Din Rep'!$B:$M,7,0),VLOOKUP(C16,'[1]Din Rep'!$C:$M,6,0)),\"\")","v":15.419},{"$f":"IFERROR(IFERROR(VLOOKUP(B16,'[1]Din Rep'!$B:$M,8,0),VLOOKUP(C16,'[1]Din Rep'!$C:$M,7,0)),\"\")","v":39.908000000000001},{"$f":"IFERROR(IFERROR(VLOOKUP(B16,'[1]Din Rep'!$B:$M,10,0),VLOOKUP(C16,'[1]Din Rep'!$C:$M,9,0)),\"\")","v":2.3294117647058825},{"$f":"IFERROR(IFERROR(VLOOKUP(B16,'[1]Din Rep'!$B:$M,11,0),VLOOKUP(C16,'[1]Din Rep'!$C:$M,10,0)),\"\")","v":0.1},{"$f":"IFERROR(IFERROR(VLOOKUP(B16,'[1]Din Rep'!$B:$M,12,0),VLOOKUP(C16,'[1]Din Rep'!$C:$M,11,0)),\"\")","v":"45 DD"}]
[null,"AC0127",{"$f":"IFERROR(VLOOKUP(B17,'[1]Din Rep'!$B:$M,2,0),\"\")","v":"KIT PULSEIRA DE NEOPRENE ACESSÓRIOS MORMAII"},{"$f":"IFERROR(IFERROR(VLOOKUP(B17,'[1]Din Rep'!$B:$M,5,0),VLOOKUP(C17,'[1]Din Rep'!$C:$M,4,0)),\"\")","v":3.6034899999999999},{"$f":"IFERROR(IFERROR(VLOOKUP(B17,'[1]Din Rep'!$B:$M,7,0),VLOOKUP(C17,'[1]Din Rep'!$C:$M,6,0)),\"\")","v":3.8334999999999999},{"$f":"IFERROR(IFERROR(VLOOKUP(B17,'[1]Din Rep'!$B:$M,8,0),VLOOKUP(C17,'[1]Din Rep'!$C:$M,7,0)),\"\")","v":9},{"$f":"IFERROR(IFERROR(VLOOKUP(B17,'[1]Din Rep'!$B:$M,10,0),VLOOKUP(C17,'[1]Din Rep'!$C:$M,9,0)),\"\")","v":2.3477240119994782},{"$f":"IFERROR(IFERROR(VLOOKUP(B17,'[1]Din Rep'!$B:$M,11,0),VLOOKUP(C17,'[1]Din Rep'!$C:$M,10,0)),\"\")","v":0},{"$f":"IFERROR(IFERROR(VLOOKUP(B17,'[1]Din Rep'!$B:$M,12,0),VLOOKUP(C17,'[1]Din Rep'!$C:$M,11,0)),\"\")","v":"45 DD"}]
[null,"A369MC",{"$f":"IFERROR(VLOOKUP(B18,'[1]Din Rep'!$B:$M,2,0),\"\")","v":"CHAVEIRO FOFO DE NEOPRENE - MORMAII"},{"$f":"IFERROR(IFERROR(VLOOKUP(B18,'[1]Din Rep'!$B:$M,5,0),VLOOKUP(C18,'[1]Din Rep'!$C:$M,4,0)),\"\")","v":3.6050879999999994},{"$f":"IFERROR(IFERROR(VLOOKUP(B18,'[1]Din Rep'!$B:$M,7,0),VLOOKUP(C18,'[1]Din Rep'!$C:$M,6,0)),\"\")","v":3.8351999999999995},{"$f":"IFERROR(IFERROR(VLOOKUP(B18,'[1]Din Rep'!$B:$M,8,0),VLOOKUP(C18,'[1]Din Rep'!$C:$M,7,0)),\"\")","v":9.9263999999999992},{"$f":"IFERROR(IFERROR(VLOOKUP(B18,'[1]Din Rep'!$B:$M,10,0),VLOOKUP(C18,'[1]Din Rep'!$C:$M,9,0)),\"\")","v":2.2776470588235296},{"$f":"IFERROR(IFERROR(VLOOKUP(B18,'[1]Din Rep'!$B:$M,11,0),VLOOKUP(C18,'[1]Din Rep'!$C:$M,10,0)),\"\")","v":0.12},{"$f":"IFERROR(IFERROR(VLOOKUP(B18,'[1]Din Rep'!$B:$M,12,0),VLOOKUP(C18,'[1]Din Rep'!$C:$M,11,0)),\"\")","v":"45 DD"}]
[null,"A370MC",{"$f":"IFERROR(VLOOKUP(B19,'[1]Din Rep'!$B:$M,2,0),\"\")","v":"LIXEIRA/PORTA GARRAFA DE NEOPRENE - MORMAII"},{"$f":"IFERROR(IFERROR(VLOOKUP(B19,'[1]Din Rep'!$B:$M,5,0),VLOOKUP(C19,'[1]Din Rep'!$C:$M,4,0)),\"\")","v":8.2217099999999981},{"$f":"IFERROR(IFERROR(VLOOKUP(B19,'[1]Din Rep'!$B:$M,7,0),VLOOKUP(C19,'[1]Din Rep'!$C:$M,6,0)),\"\")","v":8.7464999999999993},{"$f":"IFERROR(IFERROR(VLOOKUP(B19,'[1]Din Rep'!$B:$M,8,0),VLOOKUP(C19,'[1]Din Rep'!$C:$M,7,0)),\"\")","v":22.638000000000002},{"$f":"IFERROR(IFERROR(VLOOKUP(B19,'[1]Din Rep'!$B:$M,10,0),VLOOKUP(C19,'[1]Din Rep'!$C:$M,9,0)),\"\")","v":2.329411764705883},{"$f":"IFERROR(IFERROR(VLOOKUP(B19,'[1]Din Rep'!$B:$M,11,0),VLOOKUP(C19,'[1]Din Rep'!$C:$M,10,0)),\"\")","v":0.1},{"$f":"IFERROR(IFERROR(VLOOKUP(B19,'[1]Din Rep'!$B:$M,12,0),VLOOKUP(C19,'[1]Din Rep'!$C:$M,11,0)),\"\")","v":"45 DD"}]
[null,"A601A",{"$f":"IFERROR(VLOOKUP(B20,'[1]Din Rep'!$B:$M,2,0),\"\")","v":"CHAVEIRO TENIS NEOPRENE - MORMAII"},{"$f":"IFERROR(IFERROR(VLOOKUP(B20,'[1]Din Rep'!$B:$M,5,0),VLOOKUP(C20,'[1]Din Rep'!$C:$M,4,0)),\"\")","v":3.6050879999999994},{"$f":"IFERROR(IFERROR(VLOOKUP(B20,'[1]Din Rep'!$B:$M,7,0),VLOOKUP(C20,'[1]Din Rep'!$C:$M,6,0)),\"\")","v":3.8351999999999995},{"$f":"IFERROR(IFERROR(VLOOKUP(B20,'[1]Din Rep'!$B:$M,8,0),VLOOKUP(C20,'[1]Din Rep'!$C:$M,7,0)),\"\")","v":9.9263999999999992},{"$f":"IFERROR(IFERROR(VLOOKUP(B20,'[1]Din Rep'!$B:$M,10,0),VLOOKUP(C20,'[1]Din Rep'!$C:$M,9,0)),\"\")","v":2.2776470588235296},{"$f":"IFERROR(IFERROR(VLOOKUP(B20,'[1]Din Rep'!$B:$M,11,0),VLOOKUP(C20,'[1]Din Rep'!$C:$M,10,0)),\"\")","v":0.12},{"$f":"IFERROR(IFERROR(VLOOKUP(B20,'[1]Din Rep'!$B:$M,12,0),VLOOKUP(C20,'[1]Din Rep'!$C:$M,11,0)),\"\")","v":"45 DD"}]
[null,"A601B",{"$f":"IFERROR(VLOOKUP(B21,'[1]Din Rep'!$B:$M,2,0),\"\")","v":"CHAVEIRO PEIXE NEOPRENE - MORMAII"},{"$f":"IFERROR(IFERROR(VLOOKUP(B21,'[1]Din Rep'!$B:$M,5,0),VLOOKUP(C21,'[1]Din Rep'!$C:$M,4,0)),\"\")","v":3.6050879999999994},{"$f":"IFERROR(IFERROR(VLOOKUP(B21,'[1]Din Rep'!$B:$M,7,0),VLOOKUP(C21,'[1]Din Rep'!$C:$M,6,0)),\"\")","v":3.8351999999999995},{"$f":"IFERROR(IFERROR(VLOOKUP(B21,'[1]Din Rep'!$B:$M,8,0),VLOOKUP(C21,'[1]Din Rep'!$C:$M,7,0)),\"\")","v":9.9263999999999992},{"$f":"IFERROR(IFERROR(VLOOKUP(B21,'[1]Din Rep'!$B:$M,10,0),VLOOKUP(C21,'[1]Din Rep'!$C:$M,9,0)),\"\")","v":2.2776470588235296},{"$f":"IFERROR(IFERROR(VLOOKUP(B21,'[1]Din Rep'!$B:$M,11,0),VLOOKUP(C21,'[1]Din Rep'!$C:$M,10,0)),\"\")","v":0.12},{"$f":"IFERROR(IFERROR(VLOOKUP(B21,'[1]Din Rep'!$B:$M,12,0),VLOOKUP(C21,'[1]Din Rep'!$C:$M,11,0)),\"\")","v":"45 DD"}]
[null,"A601S",{"$f":"IFERROR(VLOOKUP(B22,'[1]Din Rep'!$B:$M,2,0),\"\")","v":"CHAVEIRO ROUPA DE NEOPRENE - MORMAII"},{"$f":"IFERROR(IFERROR(VLOOKUP(B22,'[1]Din Rep'!$B:$M,5,0),VLOOKUP(C22,'[1]Din Rep'!$C:$M,4,0)),\"\")","v":3.6050879999999994},{"$f":"IFERROR(IFERROR(VLOOKUP(B22,'[1]Din Rep'!$B:$M,7,0),VLOOKUP(C22,'[1]Din Rep'!$C:$M,6,0)),\"\")","v":3.8351999999999995},{"$f":"IFERROR(IFERROR(VLOOKUP(B22,'[1]Din Rep'!$B:$M,8,0),VLOOKUP(C22,'[1]Din Rep'!$C:$M,7,0)),\"\")","v":9.9263999999999992},{"$f":"IFERROR(IFERROR(VLOOKUP(B22,'[1]Din Rep'!$B:$M,10,0),VLOOKUP(C22,'[1]Din Rep'!$C:$M,9,0)),\"\")","v":2.2776470588235296},{"$f":"IFERROR(IFERROR(VLOOKUP(B22,'[1]Din Rep'!$B:$M,11,0),VLOOKUP(C22,'[1]Din Rep'!$C:$M,10,0)),\"\")","v":0.12},{"$f":"IFERROR(IFERROR(VLOOKUP(B22,'[1]Din Rep'!$B:$M,12,0),VLOOKUP(C22,'[1]Din Rep'!$C:$M,11,0)),\"\")","v":"45 DD"}]
[null,"A604A",{"$f":"IFERROR(VLOOKUP(B23,'[1]Din Rep'!$B:$M,2,0),\"\")","v":"CHAVEIRO PORTA NIQUEL NEOPRENE - MORMAII"},{"$f":"IFERROR(IFERROR(VLOOKUP(B23,'[1]Din Rep'!$B:$M,5,0),VLOOKUP(C23,'[1]Din Rep'!$C:$M,4,0)),\"\")","v":3.6050879999999994},{"$f":"IFERROR(IFERROR(VLOOKUP(B23,'[1]Din Rep'!$B:$M,7,0),VLOOKUP(C23,'[1]Din Rep'!$C:$M,6,0)),\"\")","v":3.8351999999999995},{"$f":"IFERROR(IFERROR(VLOOKUP(B23,'[1]Din Rep'!$B:$M,8,0),VLOOKUP(C23,'[1]Din Rep'!$C:$M,7,0)),\"\")","v":9.9263999999999992},{"$f":"IFERROR(IFERROR(VLOOKUP(B23,'[1]Din Rep'!$B:$M,10,0),VLOOKUP(C23,'[1]Din Rep'!$C:$M,9,0)),\"\")","v":2.2776470588235296},{"$f":"IFERROR(IFERROR(VLOOKUP(B23,'[1]Din Rep'!$B:$M,11,0),VLOOKUP(C23,'[1]Din Rep'!$C:$M,10,0)),\"\")","v":0.12},{"$f":"IFERROR(IFERROR(VLOOKUP(B23,'[1]Din Rep'!$B:$M,12,0),VLOOKUP(C23,'[1]Din Rep'!$C:$M,11,0)),\"\")","v":"45 DD"}]
[null,"A607B",{"$f":"IFERROR(VLOOKUP(B24,'[1]Din Rep'!$B:$M,2,0),\"\")","v":"CHAVEIRO GOLFINHO DE NEOPRENE - MORMAII"},{"$f":"IFERROR(IFERROR(VLOOKUP(B24,'[1]Din Rep'!$B:$M,5,0),VLOOKUP(C24,'[1]Din Rep'!$C:$M,4,0)),\"\")","v":3.6050879999999994},{"$f":"IFERROR(IFERROR(VLOOKUP(B24,'[1]Din Rep'!$B:$M,7,0),VLOOKUP(C24,'[1]Din Rep'!$C:$M,6,0)),\"\")","v":3.8351999999999995},{"$f":"IFERROR(IFERROR(VLOOKUP(B24,'[1]Din Rep'!$B:$M,8,0),VLOOKUP(C24,'[1]Din Rep'!$C:$M,7,0)),\"\")","v":9.9263999999999992},{"$f":"IFERROR(IFERROR(VLOOKUP(B24,'[1]Din Rep'!$B:$M,10,0),VLOOKUP(C24,'[1]Din Rep'!$C:$M,9,0)),\"\")","v":2.2776470588235296},{"$f":"IFERROR(IFERROR(VLOOKUP(B24,'[1]Din Rep'!$B:$M,11,0),VLOOKUP(C24,'[1]Din Rep'!$C:$M,10,0)),\"\")","v":0.12},{"$f":"IFERROR(IFERROR(VLOOKUP(B24,'[1]Din Rep'!$B:$M,12,0),VLOOKUP(C24,'[1]Din Rep'!$C:$M,11,0)),\"\")","v":"45 DD"}]
[null,"A608B",{"$f":"IFERROR(VLOOKUP(B25,'[1]Din Rep'!$B:$M,2,0),\"\")","v":"CHAVEIRO TARTARUGA NEOPRENE - MORMAII"},{"$f":"IFERROR(IFERROR(VLOOKUP(B25,'[1]Din Rep'!$B:$M,5,0),VLOOKUP(C25,'[1]Din Rep'!$C:$M,4,0)),\"\")","v":3.6050879999999994},{"$f":"IFERROR(IFERROR(VLOOKUP(B25,'[1]Din Rep'!$B:$M,7,0),VLOOKUP(C25,'[1]Din Rep'!$C:$M,6,0)),\"\")","v":3.8351999999999995},{"$f":"IFERROR(IFERROR(VLOOKUP(B25,'[1]Din Rep'!$B:$M,8,0),VLOOKUP(C25,'[1]Din Rep'!$C:$M,7,0)),\"\")","v":9.9263999999999992},{"$f":"IFERROR(IFERROR(VLOOKUP(B25,'[1]Din Rep'!$B:$M,10,0),VLOOKUP(C25,'[1]Din Rep'!$C:$M,9,0)),\"\")","v":2.2776470588235296},{"$f":"IFERROR(IFERROR(VLOOKUP(B25,'[1]Din Rep'!$B:$M,11,0),VLOOKUP(C25,'[1]Din Rep'!$C:$M,10,0)),\"\")","v":0.12},{"$f":"IFERROR(IFERROR(VLOOKUP(B25,'[1]Din Rep'!$B:$M,12,0),VLOOKUP(C25,'[1]Din Rep'!$C:$M,11,0)),\"\")","v":"45 DD"}]
[null,"A609B",{"$f":"IFERROR(VLOOKUP(B26,'[1]Din Rep'!$B:$M,2,0),\"\")","v":"CHAVEIRO BALEIA FRANCA DE NEOPRENE - MORMAII"},{"$f":"IFERROR(IFERROR(VLOOKUP(B26,'[1]Din Rep'!$B:$M,5,0),VLOOKUP(C26,'[1]Din Rep'!$C:$M,4,0)),\"\")","v":3.6050879999999994},{"$f":"IFERROR(IFERROR(VLOOKUP(B26,'[1]Din Rep'!$B:$M,7,0),VLOOKUP(C26,'[1]Din Rep'!$C:$M,6,0)),\"\")","v":3.8351999999999995},{"$f":"IFERROR(IFERROR(VLOOKUP(B26,'[1]Din Rep'!$B:$M,8,0),VLOOKUP(C26,'[1]Din Rep'!$C:$M,7,0)),\"\")","v":9.9263999999999992},{"$f":"IFERROR(IFERROR(VLOOKUP(B26,'[1]Din Rep'!$B:$M,10,0),VLOOKUP(C26,'[1]Din Rep'!$C:$M,9,0)),\"\")","v":2.2776470588235296},{"$f":"IFERROR(IFERROR(VLOOKUP(B26,'[1]Din Rep'!$B:$M,11,0),VLOOKUP(C26,'[1]Din Rep'!$C:$M,10,0)),\"\")","v":0.12},{"$f":"IFERROR(IFERROR(VLOOKUP(B26,'[1]Din Rep'!$B:$M,12,0),VLOOKUP(C26,'[1]Din Rep'!$C:$M,11,0)),\"\")","v":"45 DD"}]
[null,"AC0104",{"$f":"IFERROR(VLOOKUP(B27,'[1]Din Rep'!$B:$M,2,0),\"\")","v":"JOGO COM 02 CAPAS DE BANCO (MOTORISTA E PASSAGEIRO)"},{"$f":"IFERROR(IFERROR(VLOOKUP(B27,'[1]Din Rep'!$B:$M,5,0),VLOOKUP(C27,'[1]Din Rep'!$C:$M,4,0)),\"\")","v":156.52409999999998},{"$f":"IFERROR(IFERROR(VLOOKUP(B27,'[1]Din Rep'!$B:$M,7,0),VLOOKUP(C27,'[1]Din Rep'!$C:$M,6,0)),\"\")","v":166.51499999999999},{"$f":"IFERROR(IFERROR(VLOOKUP(B27,'[1]Din Rep'!$B:$M,8,0),VLOOKUP(C27,'[1]Din Rep'!$C:$M,7,0)),\"\")","v":430.98000000000008},{"$f":"IFERROR(IFERROR(VLOOKUP(B27,'[1]Din Rep'!$B:$M,10,0),VLOOKUP(C27,'[1]Din Rep'!$C:$M,9,0)),\"\")","v":2.329411764705883},{"$f":"IFERROR(IFERROR(VLOOKUP(B27,'[1]Din Rep'!$B:$M,11,0),VLOOKUP(C27,'[1]Din Rep'!$C:$M,10,0)),\"\")","v":0.1},{"$f":"IFERROR(IFERROR(VLOOKUP(B27,'[1]Din Rep'!$B:$M,12,0),VLOOKUP(C27,'[1]Din Rep'!$C:$M,11,0)),\"\")","v":"45 DD"}]
[null,"AC0004",{"$f":"IFERROR(VLOOKUP(B28,'[1]Din Rep'!$B:$M,2,0),\"\")","v":"PORTA ÓCULOS DE NEOPRENE P/ CARRO - MORMAII"},{"$f":"IFERROR(IFERROR(VLOOKUP(B28,'[1]Din Rep'!$B:$M,5,0),VLOOKUP(C28,'[1]Din Rep'!$C:$M,4,0)),\"\")","v":11.905099999999999},{"$f":"IFERROR(IFERROR(VLOOKUP(B28,'[1]Din Rep'!$B:$M,7,0),VLOOKUP(C28,'[1]Din Rep'!$C:$M,6,0)),\"\")","v":12.664999999999999},{"$f":"IFERROR(IFERROR(VLOOKUP(B28,'[1]Din Rep'!$B:$M,8,0),VLOOKUP(C28,'[1]Din Rep'!$C:$M,7,0)),\"\")","v":32.78},{"$f":"IFERROR(IFERROR(VLOOKUP(B28,'[1]Din Rep'!$B:$M,10,0),VLOOKUP(C28,'[1]Din Rep'!$C:$M,9,0)),\"\")","v":2.3294117647058825},{"$f":"IFERROR(IFERROR(VLOOKUP(B28,'[1]Din Rep'!$B:$M,11,0),VLOOKUP(C28,'[1]Din Rep'!$C:$M,10,0)),\"\")","v":0.1},{"$f":"IFERROR(IFERROR(VLOOKUP(B28,'[1]Din Rep'!$B:$M,12,0),VLOOKUP(C28,'[1]Din Rep'!$C:$M,11,0)),\"\")","v":"45 DD"}]
[null,"AC0009",{"$f":"IFERROR(VLOOKUP(B29,'[1]Din Rep'!$B:$M,2,0),\"\")","v":"BOLSA PRAIA DE NEOPRENE 40X50CM ACESSÓRIOS MORMAII"},{"$f":"IFERROR(IFERROR(VLOOKUP(B29,'[1]Din Rep'!$B:$M,5,0),VLOOKUP(C29,'[1]Din Rep'!$C:$M,4,0)),\"\")","v":56.728999999999999},{"$f":"IFERROR(IFERROR(VLOOKUP(B29,'[1]Din Rep'!$B:$M,7,0),VLOOKUP(C29,'[1]Din Rep'!$C:$M,6,0)),\"\")","v":60.35},{"$f":"IFERROR(IFERROR(VLOOKUP(B29,'[1]Din Rep'!$B:$M,8,0),VLOOKUP(C29,'[1]Din Rep'!$C:$M,7,0)),\"\")","v":159.9},{"$f":"IFERROR(IFERROR(VLOOKUP(B29,'[1]Din Rep'!$B:$M,10,0),VLOOKUP(C29,'[1]Din Rep'!$C:$M,9,0)),\"\")","v":2.3845898922949464},{"$f":"IFERROR(IFERROR(VLOOKUP(B29,'[1]Din Rep'!$B:$M,11,0),VLOOKUP(C29,'[1]Din Rep'!$C:$M,10,0)),\"\")","v":0.1},{"$f":"IFERROR(IFERROR(VLOOKUP(B29,'[1]Din Rep'!$B:$M,12,0),VLOOKUP(C29,'[1]Din Rep'!$C:$M,11,0)),\"\")","v":"45 DD"}]
[null,"AC0113",{"$f":"IFERROR(VLOOKUP(B30,'[1]Din Rep'!$B:$M,2,0),\"\")","v":"BOLSA UTILITÁRIA DE NEOPRENE ACESSÓRIOS MORMAII"},{"$f":"IFERROR(IFERROR(VLOOKUP(B30,'[1]Din Rep'!$B:$M,5,0),VLOOKUP(C30,'[1]Din Rep'!$C:$M,4,0)),\"\")","v":56.728999999999999},{"$f":"IFERROR(IFERROR(VLOOKUP(B30,'[1]Din Rep'!$B:$M,7,0),VLOOKUP(C30,'[1]Din Rep'!$C:$M,6,0)),\"\")","v":60.35},{"$f":"IFERROR(IFERROR(VLOOKUP(B30,'[1]Din Rep'!$B:$M,8,0),VLOOKUP(C30,'[1]Din Rep'!$C:$M,7,0)),\"\")","v":159.9},{"$f":"IFERROR(IFERROR(VLOOKUP(B30,'[1]Din Rep'!$B:$M,10,0),VLOOKUP(C30,'[1]Din Rep'!$C:$M,9,0)),\"\")","v":2.3845898922949464},{"$f":"IFERROR(IFERROR(VLOOKUP(B30,'[1]Din Rep'!$B:$M,11,0),VLOOKUP(C30,'[1]Din Rep'!$C:$M,10,0)),\"\")","v":0.1},{"$f":"IFERROR(IFERROR(VLOOKUP(B30,'[1]Din Rep'!$B:$M,12,0),VLOOKUP(C30,'[1]Din Rep'!$C:$M,11,0)),\"\")","v":"45 DD"}]
[null,"AC0011",{"$f":"IFERROR(VLOOKUP(B31,'[1]Din Rep'!$B:$M,2,0),\"\")","v":"MÁSCARA DE NEOPRENE P/ DORMIR - MORMAII"},{"$f":"IFERROR(IFERROR(VLOOKUP(B31,'[1]Din Rep'!$B:$M,5,0),VLOOKUP(C31,'[1]Din Rep'!$C:$M,4,0)),\"\")","v":7.23095},{"$f":"IFERROR(IFERROR(VLOOKUP(B31,'[1]Din Rep'!$B:$M,7,0),VLOOKUP(C31,'[1]Din Rep'!$C:$M,6,0)),\"\")","v":7.6925000000000008},{"$f":"IFERROR(IFERROR(VLOOKUP(B31,'[1]Din Rep'!$B:$M,8,0),VLOOKUP(C31,'[1]Din Rep'!$C:$M,7,0)),\"\")","v":19.910000000000004},{"$f":"IFERROR(IFERROR(VLOOKUP(B31,'[1]Din Rep'!$B:$M,10,0),VLOOKUP(C31,'[1]Din Rep'!$C:$M,9,0)),\"\")","v":2.3294117647058825},{"$f":"IFERROR(IFERROR(VLOOKUP(B31,'[1]Din Rep'!$B:$M,11,0),VLOOKUP(C31,'[1]Din Rep'!$C:$M,10,0)),\"\")","v":0.1},{"$f":"IFERROR(IFERROR(VLOOKUP(B31,'[1]Din Rep'!$B:$M,12,0),VLOOKUP(C31,'[1]Din Rep'!$C:$M,11,0)),\"\")","v":"45 DD"}]
[null,"AC0013",{"$f":"IFERROR(VLOOKUP(B32,'[1]Din Rep'!$B:$M,2,0),\"\")","v":"LUVA ACADEMIA DE NEOPRENE MEIO DEDO ACESSÓRIOS MORMAII"},{"$f":"IFERROR(IFERROR(VLOOKUP(B32,'[1]Din Rep'!$B:$M,5,0),VLOOKUP(C32,'[1]Din Rep'!$C:$M,4,0)),\"\")","v":18.376999999999999},{"$f":"IFERROR(IFERROR(VLOOKUP(B32,'[1]Din Rep'!$B:$M,7,0),VLOOKUP(C32,'[1]Din Rep'!$C:$M,6,0)),\"\")","v":19.55},{"$f":"IFERROR(IFERROR(VLOOKUP(B32,'[1]Din Rep'!$B:$M,8,0),VLOOKUP(C32,'[1]Din Rep'!$C:$M,7,0)),\"\")","v":49.9},{"$f":"IFERROR(IFERROR(VLOOKUP(B32,'[1]Din Rep'!$B:$M,10,0),VLOOKUP(C32,'[1]Din Rep'!$C:$M,9,0)),\"\")","v":2.2971867007672633},{"$f":"IFERROR(IFERROR(VLOOKUP(B32,'[1]Din Rep'!$B:$M,11,0),VLOOKUP(C32,'[1]Din Rep'!$C:$M,10,0)),\"\")","v":0.1},{"$f":"IFERROR(IFERROR(VLOOKUP(B32,'[1]Din Rep'!$B:$M,12,0),VLOOKUP(C32,'[1]Din Rep'!$C:$M,11,0)),\"\")","v":"45 DD"}]
[null,"AC0014",{"$f":"IFERROR(VLOOKUP(B33,'[1]Din Rep'!$B:$M,2,0),\"\")","v":"ALMOFADA DE NEOPRENE P/ PESCOÇO - MORMAII"},{"$f":"IFERROR(IFERROR(VLOOKUP(B33,'[1]Din Rep'!$B:$M,5,0),VLOOKUP(C33,'[1]Din Rep'!$C:$M,4,0)),\"\")","v":27.038160000000001},{"$f":"IFERROR(IFERROR(VLOOKUP(B33,'[1]Din Rep'!$B:$M,7,0),VLOOKUP(C33,'[1]Din Rep'!$C:$M,6,0)),\"\")","v":28.764000000000003},{"$f":"IFERROR(IFERROR(VLOOKUP(B33,'[1]Din Rep'!$B:$M,8,0),VLOOKUP(C33,'[1]Din Rep'!$C:$M,7,0)),\"\")","v":74.448000000000008},{"$f":"IFERROR(IFERROR(VLOOKUP(B33,'[1]Din Rep'!$B:$M,10,0),VLOOKUP(C33,'[1]Din Rep'!$C:$M,9,0)),\"\")","v":2.3294117647058825},{"$f":"IFERROR(IFERROR(VLOOKUP(B33,'[1]Din Rep'!$B:$M,11,0),VLOOKUP(C33,'[1]Din Rep'!$C:$M,10,0)),\"\")","v":0.1},{"$f":"IFERROR(IFERROR(VLOOKUP(B33,'[1]Din Rep'!$B:$M,12,0),VLOOKUP(C33,'[1]Din Rep'!$C:$M,11,0)),\"\")","v":"45 DD"}]
[null,"AC0024",{"$f":"IFERROR(VLOOKUP(B34,'[1]Din Rep'!$B:$M,2,0),\"\")","v":"ESTOJO DE NEOPRENE C/ ZÍPER P/ ÓCULOS - MORMAII"},{"$f":"IFERROR(IFERROR(VLOOKUP(B34,'[1]Din Rep'!$B:$M,5,0),VLOOKUP(C34,'[1]Din Rep'!$C:$M,4,0)),\"\")","v":9.6838799999999985},{"$f":"IFERROR(IFERROR(VLOOKUP(B34,'[1]Din Rep'!$B:$M,7,0),VLOOKUP(C34,'[1]Din Rep'!$C:$M,6,0)),\"\")","v":10.302},{"$f":"IFERROR(IFERROR(VLOOKUP(B34,'[1]Din Rep'!$B:$M,8,0),VLOOKUP(C34,'[1]Din Rep'!$C:$M,7,0)),\"\")","v":26.664000000000001},{"$f":"IFERROR(IFERROR(VLOOKUP(B34,'[1]Din Rep'!$B:$M,10,0),VLOOKUP(C34,'[1]Din Rep'!$C:$M,9,0)),\"\")","v":2.3294117647058825},{"$f":"IFERROR(IFERROR(VLOOKUP(B34,'[1]Din Rep'!$B:$M,11,0),VLOOKUP(C34,'[1]Din Rep'!$C:$M,10,0)),\"\")","v":0.1},{"$f":"IFERROR(IFERROR(VLOOKUP(B34,'[1]Din Rep'!$B:$M,12,0),VLOOKUP(C34,'[1]Din Rep'!$C:$M,11,0)),\"\")","v":"45 DD"}]
[null,"AC0029",{"$f":"IFERROR(VLOOKUP(B35,'[1]Din Rep'!$B:$M,2,0),\"\")","v":"BRACELETE PORTA VALOR DE NEOPRENE - MORMAII"},{"$f":"IFERROR(IFERROR(VLOOKUP(B35,'[1]Din Rep'!$B:$M,5,0),VLOOKUP(C35,'[1]Din Rep'!$C:$M,4,0)),\"\")","v":7.007229999999999},{"$f":"IFERROR(IFERROR(VLOOKUP(B35,'[1]Din Rep'!$B:$M,7,0),VLOOKUP(C35,'[1]Din Rep'!$C:$M,6,0)),\"\")","v":7.4544999999999995},{"$f":"IFERROR(IFERROR(VLOOKUP(B35,'[1]Din Rep'!$B:$M,8,0),VLOOKUP(C35,'[1]Din Rep'!$C:$M,7,0)),\"\")","v":19.294},{"$f":"IFERROR(IFERROR(VLOOKUP(B35,'[1]Din Rep'!$B:$M,10,0),VLOOKUP(C35,'[1]Din Rep'!$C:$M,9,0)),\"\")","v":2.3294117647058825},{"$f":"IFERROR(IFERROR(VLOOKUP(B35,'[1]Din Rep'!$B:$M,11,0),VLOOKUP(C35,'[1]Din Rep'!$C:$M,10,0)),\"\")","v":0.1},{"$f":"IFERROR(IFERROR(VLOOKUP(B35,'[1]Din Rep'!$B:$M,12,0),VLOOKUP(C35,'[1]Din Rep'!$C:$M,11,0)),\"\")","v":"45 DD"}]
[null,"AC0030",{"$f":"IFERROR(VLOOKUP(B36,'[1]Din Rep'!$B:$M,2,0),\"\")","v":"BRACELETE PORTA CHAVE DE NEOPRENE - MORMAII"},{"$f":"IFERROR(IFERROR(VLOOKUP(B36,'[1]Din Rep'!$B:$M,5,0),VLOOKUP(C36,'[1]Din Rep'!$C:$M,4,0)),\"\")","v":7.007229999999999},{"$f":"IFERROR(IFERROR(VLOOKUP(B36,'[1]Din Rep'!$B:$M,7,0),VLOOKUP(C36,'[1]Din Rep'!$C:$M,6,0)),\"\")","v":7.4544999999999995},{"$f":"IFERROR(IFERROR(VLOOKUP(B36,'[1]Din Rep'!$B:$M,8,0),VLOOKUP(C36,'[1]Din Rep'!$C:$M,7,0)),\"\")","v":19.294},{"$f":"IFERROR(IFERROR(VLOOKUP(B36,'[1]Din Rep'!$B:$M,10,0),VLOOKUP(C36,'[1]Din Rep'!$C:$M,9,0)),\"\")","v":2.3294117647058825},{"$f":"IFERROR(IFERROR(VLOOKUP(B36,'[1]Din Rep'!$B:$M,11,0),VLOOKUP(C36,'[1]Din Rep'!$C:$M,10,0)),\"\")","v":0.1},{"$f":"IFERROR(IFERROR(VLOOKUP(B36,'[1]Din Rep'!$B:$M,12,0),VLOOKUP(C36,'[1]Din Rep'!$C:$M,11,0)),\"\")","v":"45 DD"}]
[null,"AC0031",{"$f":"IFERROR(VLOOKUP(B37,'[1]Din Rep'!$B:$M,2,0),\"\")","v":"PORTA CELULAR DE BRAÇO DE NEOPRENE - MORMAII"},{"$f":"IFERROR(IFERROR(VLOOKUP(B37,'[1]Din Rep'!$B:$M,5,0),VLOOKUP(C37,'[1]Din Rep'!$C:$M,4,0)),\"\")","v":13.039679999999999},{"$f":"IFERROR(IFERROR(VLOOKUP(B37,'[1]Din Rep'!$B:$M,7,0),VLOOKUP(C37,'[1]Din Rep'!$C:$M,6,0)),\"\")","v":13.872},{"$f":"IFERROR(IFERROR(VLOOKUP(B37,'[1]Din Rep'!$B:$M,8,0),VLOOKUP(C37,'[1]Din Rep'!$C:$M,7,0)),\"\")","v":35.904000000000003},{"$f":"IFERROR(IFERROR(VLOOKUP(B37,'[1]Din Rep'!$B:$M,10,0),VLOOKUP(C37,'[1]Din Rep'!$C:$M,9,0)),\"\")","v":2.3294117647058825},{"$f":"IFERROR(IFERROR(VLOOKUP(B37,'[1]Din Rep'!$B:$M,11,0),VLOOKUP(C37,'[1]Din Rep'!$C:$M,10,0)),\"\")","v":0.1},{"$f":"IFERROR(IFERROR(VLOOKUP(B37,'[1]Din Rep'!$B:$M,12,0),VLOOKUP(C37,'[1]Din Rep'!$C:$M,11,0)),\"\")","v":"45 DD"}]
[null,"AC0035",{"$f":"IFERROR(VLOOKUP(B38,'[1]Din Rep'!$B:$M,2,0),\"\")","v":"MINI LANCHEIRA DE NEOPRENE - MORMAII"},{"$f":"IFERROR(IFERROR(VLOOKUP(B38,'[1]Din Rep'!$B:$M,5,0),VLOOKUP(C38,'[1]Din Rep'!$C:$M,4,0)),\"\")","v":23.091099999999997},{"$f":"IFERROR(IFERROR(VLOOKUP(B38,'[1]Din Rep'!$B:$M,7,0),VLOOKUP(C38,'[1]Din Rep'!$C:$M,6,0)),\"\")","v":24.564999999999998},{"$f":"IFERROR(IFERROR(VLOOKUP(B38,'[1]Din Rep'!$B:$M,8,0),VLOOKUP(C38,'[1]Din Rep'!$C:$M,7,0)),\"\")","v":63.580000000000005},{"$f":"IFERROR(IFERROR(VLOOKUP(B38,'[1]Din Rep'!$B:$M,10,0),VLOOKUP(C38,'[1]Din Rep'!$C:$M,9,0)),\"\")","v":2.329411764705883},{"$f":"IFERROR(IFERROR(VLOOKUP(B38,'[1]Din Rep'!$B:$M,11,0),VLOOKUP(C38,'[1]Din Rep'!$C:$M,10,0)),\"\")","v":0.1},{"$f":"IFERROR(IFERROR(VLOOKUP(B38,'[1]Din Rep'!$B:$M,12,0),VLOOKUP(C38,'[1]Din Rep'!$C:$M,11,0)),\"\")","v":"45 DD"}]
[null,"AC0091",{"$f":"IFERROR(VLOOKUP(B39,'[1]Din Rep'!$B:$M,2,0),\"\")","v":"CHAVEIRO LOGO DE NEOPRENE - MORMAII"},{"$f":"IFERROR(IFERROR(VLOOKUP(B39,'[1]Din Rep'!$B:$M,5,0),VLOOKUP(C39,'[1]Din Rep'!$C:$M,4,0)),\"\")","v":3.6050879999999994},{"$f":"IFERROR(IFERROR(VLOOKUP(B39,'[1]Din Rep'!$B:$M,7,0),VLOOKUP(C39,'[1]Din Rep'!$C:$M,6,0)),\"\")","v":3.8351999999999995},{"$f":"IFERROR(IFERROR(VLOOKUP(B39,'[1]Din Rep'!$B:$M,8,0),VLOOKUP(C39,'[1]Din Rep'!$C:$M,7,0)),\"\")","v":9.9263999999999992},{"$f":"IFERROR(IFERROR(VLOOKUP(B39,'[1]Din Rep'!$B:$M,10,0),VLOOKUP(C39,'[1]Din Rep'!$C:$M,9,0)),\"\")","v":2.2776470588235296},{"$f":"IFERROR(IFERROR(VLOOKUP(B39,'[1]Din Rep'!$B:$M,11,0),VLOOKUP(C39,'[1]Din Rep'!$C:$M,10,0)),\"\")","v":0.12},{"$f":"IFERROR(IFERROR(VLOOKUP(B39,'[1]Din Rep'!$B:$M,12,0),VLOOKUP(C39,'[1]Din Rep'!$C:$M,11,0)),\"\")","v":"45 DD"}]
[null,"AC0092",{"$f":"IFERROR(VLOOKUP(B40,'[1]Din Rep'!$B:$M,2,0),\"\")","v":"CHAVEIRO BONÉ NEOPRENE- MORMAII"},{"$f":"IFERROR(IFERROR(VLOOKUP(B40,'[1]Din Rep'!$B:$M,5,0),VLOOKUP(C40,'[1]Din Rep'!$C:$M,4,0)),\"\")","v":3.6050879999999994},{"$f":"IFERROR(IFERROR(VLOOKUP(B40,'[1]Din Rep'!$B:$M,7,0),VLOOKUP(C40,'[1]Din Rep'!$C:$M,6,0)),\"\")","v":3.8351999999999995},{"$f":"IFERROR(IFERROR(VLOOKUP(B40,'[1]Din Rep'!$B:$M,8,0),VLOOKUP(C40,'[1]Din Rep'!$C:$M,7,0)),\"\")","v":9.9263999999999992},{"$f":"IFERROR(IFERROR(VLOOKUP(B40,'[1]Din Rep'!$B:$M,10,0),VLOOKUP(C40,'[1]Din Rep'!$C:$M,9,0)),\"\")","v":2.2776470588235296},{"$f":"IFERROR(IFERROR(VLOOKUP(B40,'[1]Din Rep'!$B:$M,11,0),VLOOKUP(C40,'[1]Din Rep'!$C:$M,10,0)),\"\")","v":0.12},{"$f":"IFERROR(IFERROR(VLOOKUP(B40,'[1]Din Rep'!$B:$M,12,0),VLOOKUP(C40,'[1]Din Rep'!$C:$M,11,0)),\"\")","v":"45 DD"}]
[null,"AC0093",{"$f":"IFERROR(VLOOKUP(B41,'[1]Din Rep'!$B:$M,2,0),\"\")","v":"CHAVEIRO PIRAMIDE NEOPRENE - MORMAII"},{"$f":"IFERROR(IFERROR(VLOOKUP(B41,'[1]Din Rep'!$B:$M,5,0),VLOOKUP(C41,'[1]Din Rep'!$C:$M,4,0)),\"\")","v":3.6050879999999994},{"$f":"IFERROR(IFERROR(VLOOKUP(B41,'[1]Din Rep'!$B:$M,7,0),VLOOKUP(C41,'[1]Din Rep'!$C:$M,6,0)),\"\")","v":3.8351999999999995},{"$f":"IFERROR(IFERROR(VLOOKUP(B41,'[1]Din Rep'!$B:$M,8,0),VLOOKUP(C41,'[1]Din Rep'!$C:$M,7,0)),\"\")","v":9.9263999999999992},{"$f":"IFERROR(IFERROR(VLOOKUP(B41,'[1]Din Rep'!$B:$M,10,0),VLOOKUP(C41,'[1]Din Rep'!$C:$M,9,0)),\"\")","v":2.2776470588235296},{"$f":"IFERROR(IFERROR(VLOOKUP(B41,'[1]Din Rep'!$B:$M,11,0),VLOOKUP(C41,'[1]Din Rep'!$C:$M,10,0)),\"\")","v":0.12},{"$f":"IFERROR(IFERROR(VLOOKUP(B41,'[1]Din Rep'!$B:$M,12,0),VLOOKUP(C41,'[1]Din Rep'!$C:$M,11,0)),\"\")","v":"45 DD"}]
[null,"AC0094",{"$f":"IFERROR(VLOOKUP(B42,'[1]Din Rep'!$B:$M,2,0),\"\")","v":"CHAVEIRO PORTA CARTÃO DE NEOPRENE - MORMAII"},{"$f":"IFERROR(IFERROR(VLOOKUP(B42,'[1]Din Rep'!$B:$M,5,0),VLOOKUP(C42,'[1]Din Rep'!$C:$M,4,0)),\"\")","v":3.6050879999999994},{"$f":"IFERROR(IFERROR(VLOOKUP(B42,'[1]Din Rep'!$B:$M,7,0),VLOOKUP(C42,'[1]Din Rep'!$C:$M,6,0)),\"\")","v":3.8351999999999995},{"$f":"IFERROR(IFERROR(VLOOKUP(B42,'[1]Din Rep'!$B:$M,8,0),VLOOKUP(C42,'[1]Din Rep'!$C:$M,7,0)),\"\")","v":9.9263999999999992},{"$f":"IFERROR(IFERROR(VLOOKUP(B42,'[1]Din Rep'!$B:$M,10,0),VLOOKUP(C42,'[1]Din Rep'!$C:$M,9,0)),\"\")","v":2.2776470588235296},{"$f":"IFERROR(IFERROR(VLOOKUP(B42,'[1]Din Rep'!$B:$M,11,0),VLOOKUP(C42,'[1]Din Rep'!$C:$M,10,0)),\"\")","v":0.12},{"$f":"IFERROR(IFERROR(VLOOKUP(B42,'[1]Din Rep'!$B:$M,12,0),VLOOKUP(C42,'[1]Din Rep'!$C:$M,11,0)),\"\")","v":"45 DD"}]
[null,"AC0095",{"$f":"IFERROR(VLOOKUP(B43,'[1]Din Rep'!$B:$M,2,0),\"\")","v":"CHAVEIRO MOTOBOY NEOPRENE ACESSÓRIOS MORMAII"},{"$f":"IFERROR(IFERROR(VLOOKUP(B43,'[1]Din Rep'!$B:$M,5,0),VLOOKUP(C43,'[1]Din Rep'!$C:$M,4,0)),\"\")","v":3.6050879999999994},{"$f":"IFERROR(IFERROR(VLOOKUP(B43,'[1]Din Rep'!$B:$M,7,0),VLOOKUP(C43,'[1]Din Rep'!$C:$M,6,0)),\"\")","v":3.8351999999999995},{"$f":"IFERROR(IFERROR(VLOOKUP(B43,'[1]Din Rep'!$B:$M,8,0),VLOOKUP(C43,'[1]Din Rep'!$C:$M,7,0)),\"\")","v":9.9263999999999992},{"$f":"IFERROR(IFERROR(VLOOKUP(B43,'[1]Din Rep'!$B:$M,10,0),VLOOKUP(C43,'[1]Din Rep'!$C:$M,9,0)),\"\")","v":2.2776470588235296},{"$f":"IFERROR(IFERROR(VLOOKUP(B43,'[1]Din Rep'!$B:$M,11,0),VLOOKUP(C43,'[1]Din Rep'!$C:$M,10,0)),\"\")","v":0.12},{"$f":"IFERROR(IFERROR(VLOOKUP(B43,'[1]Din Rep'!$B:$M,12,0),VLOOKUP(C43,'[1]Din Rep'!$C:$M,11,0)),\"\")","v":"45 DD"}]
[null,"AO0006",{"$f":"IFERROR(VLOOKUP(B44,'[1]Din Rep'!$B:$M,2,0),\"\")","v":"MINI NECESSAIRE OPORTUNIDADES MORMAII"},{"$f":"IFERROR(IFERROR(VLOOKUP(B44,'[1]Din Rep'!$B:$M,5,0),VLOOKUP(C44,'[1]Din Rep'!$C:$M,4,0)),\"\")","v":8.8209599999999977},{"$f":"IFERROR(IFERROR(VLOOKUP(B44,'[1]Din Rep'!$B:$M,7,0),VLOOKUP(C44,'[1]Din Rep'!$C:$M,6,0)),\"\")","v":9.3839999999999986},{"$f":"IFERROR(IFERROR(VLOOKUP(B44,'[1]Din Rep'!$B:$M,8,0),VLOOKUP(C44,'[1]Din Rep'!$C:$M,7,0)),\"\")","v":24.288},{"$f":"IFERROR(IFERROR(VLOOKUP(B44,'[1]Din Rep'!$B:$M,10,0),VLOOKUP(C44,'[1]Din Rep'!$C:$M,9,0)),\"\")","v":2.329411764705883},{"$f":"IFERROR(IFERROR(VLOOKUP(B44,'[1]Din Rep'!$B:$M,11,0),VLOOKUP(C44,'[1]Din Rep'!$C:$M,10,0)),\"\")","v":0.1},{"$f":"IFERROR(IFERROR(VLOOKUP(B44,'[1]Din Rep'!$B:$M,12,0),VLOOKUP(C44,'[1]Din Rep'!$C:$M,11,0)),\"\")","v":"45 DD"}]
[null,"A602B",{"$f":"IFERROR(VLOOKUP(B45,'[1]Din Rep'!$B:$M,2,0),\"\")","v":"CHAVEIRO TUBARÃO"},{"$f":"IFERROR(IFERROR(VLOOKUP(B45,'[1]Din Rep'!$B:$M,5,0),VLOOKUP(C45,'[1]Din Rep'!$C:$M,4,0)),\"\")","v":3.6050879999999994},{"$f":"IFERROR(IFERROR(VLOOKUP(B45,'[1]Din Rep'!$B:$M,7,0),VLOOKUP(C45,'[1]Din Rep'!$C:$M,6,0)),\"\")","v":3.8351999999999995},{"$f":"IFERROR(IFERROR(VLOOKUP(B45,'[1]Din Rep'!$B:$M,8,0),VLOOKUP(C45,'[1]Din Rep'!$C:$M,7,0)),\"\")","v":9.9263999999999992},{"$f":"IFERROR(IFERROR(VLOOKUP(B45,'[1]Din Rep'!$B:$M,10,0),VLOOKUP(C45,'[1]Din Rep'!$C:$M,9,0)),\"\")","v":2.2776470588235296},{"$f":"IFERROR(IFERROR(VLOOKUP(B45,'[1]Din Rep'!$B:$M,11,0),VLOOKUP(C45,'[1]Din Rep'!$C:$M,10,0)),\"\")","v":0.12},{"$f":"IFERROR(IFERROR(VLOOKUP(B45,'[1]Din Rep'!$B:$M,12,0),VLOOKUP(C45,'[1]Din Rep'!$C:$M,11,0)),\"\")","v":"45 DD"}]
[null,"AC0096",{"$f":"IFERROR(VLOOKUP(B46,'[1]Din Rep'!$B:$M,2,0),\"\")","v":"SEGURANÇA FECHADA ÓCULOS"},{"$f":"IFERROR(IFERROR(VLOOKUP(B46,'[1]Din Rep'!$B:$M,5,0),VLOOKUP(C46,'[1]Din Rep'!$C:$M,4,0)),\"\")","v":5.2014899999999997},{"$f":"IFERROR(IFERROR(VLOOKUP(B46,'[1]Din Rep'!$B:$M,7,0),VLOOKUP(C46,'[1]Din Rep'!$C:$M,6,0)),\"\")","v":5.5335000000000001},{"$f":"IFERROR(IFERROR(VLOOKUP(B46,'[1]Din Rep'!$B:$M,8,0),VLOOKUP(C46,'[1]Din Rep'!$C:$M,7,0)),\"\")","v":14.322000000000001},{"$f":"IFERROR(IFERROR(VLOOKUP(B46,'[1]Din Rep'!$B:$M,10,0),VLOOKUP(C46,'[1]Din Rep'!$C:$M,9,0)),\"\")","v":2.2776470588235296},{"$f":"IFERROR(IFERROR(VLOOKUP(B46,'[1]Din Rep'!$B:$M,11,0),VLOOKUP(C46,'[1]Din Rep'!$C:$M,10,0)),\"\")","v":0.12},{"$f":"IFERROR(IFERROR(VLOOKUP(B46,'[1]Din Rep'!$B:$M,12,0),VLOOKUP(C46,'[1]Din Rep'!$C:$M,11,0)),\"\")","v":"45 DD"}]
[null,"AC0097",{"$f":"IFERROR(VLOOKUP(B47,'[1]Din Rep'!$B:$M,2,0),\"\")","v":"CHAVEIRO JET SKY"},{"$f":"IFERROR(IFERROR(VLOOKUP(B47,'[1]Din Rep'!$B:$M,5,0),VLOOKUP(C47,'[1]Din Rep'!$C:$M,4,0)),\"\")","v":3.6050879999999994},{"$f":"IFERROR(IFERROR(VLOOKUP(B47,'[1]Din Rep'!$B:$M,7,0),VLOOKUP(C47,'[1]Din Rep'!$C:$M,6,0)),\"\")","v":3.8351999999999995},{"$f":"IFERROR(IFERROR(VLOOKUP(B47,'[1]Din Rep'!$B:$M,8,0),VLOOKUP(C47,'[1]Din Rep'!$C:$M,7,0)),\"\")","v":9.9263999999999992},{"$f":"IFERROR(IFERROR(VLOOKUP(B47,'[1]Din Rep'!$B:$M,10,0),VLOOKUP(C47,'[1]Din Rep'!$C:$M,9,0)),\"\")","v":2.2776470588235296},{"$f":"IFERROR(IFERROR(VLOOKUP(B47,'[1]Din Rep'!$B:$M,11,0),VLOOKUP(C47,'[1]Din Rep'!$C:$M,10,0)),\"\")","v":0.12},{"$f":"IFERROR(IFERROR(VLOOKUP(B47,'[1]Din Rep'!$B:$M,12,0),VLOOKUP(C47,'[1]Din Rep'!$C:$M,11,0)),\"\")","v":"45 DD"}]
[null,"AC0098",{"$f":"IFERROR(VLOOKUP(B48,'[1]Din Rep'!$B:$M,2,0),\"\")","v":"CHAVEIRO DADO"},{"$f":"IFERROR(IFERROR(VLOOKUP(B48,'[1]Din Rep'!$B:$M,5,0),VLOOKUP(C48,'[1]Din Rep'!$C:$M,4,0)),\"\")","v":3.6050879999999994},{"$f":"IFERROR(IFERROR(VLOOKUP(B48,'[1]Din Rep'!$B:$M,7,0),VLOOKUP(C48,'[1]Din Rep'!$C:$M,6,0)),\"\")","v":3.8351999999999995},{"$f":"IFERROR(IFERROR(VLOOKUP(B48,'[1]Din Rep'!$B:$M,8,0),VLOOKUP(C48,'[1]Din Rep'!$C:$M,7,0)),\"\")","v":9.9263999999999992},{"$f":"IFERROR(IFERROR(VLOOKUP(B48,'[1]Din Rep'!$B:$M,10,0),VLOOKUP(C48,'[1]Din Rep'!$C:$M,9,0)),\"\")","v":2.2776470588235296},{"$f":"IFERROR(IFERROR(VLOOKUP(B48,'[1]Din Rep'!$B:$M,11,0),VLOOKUP(C48,'[1]Din Rep'!$C:$M,10,0)),\"\")","v":0.12},{"$f":"IFERROR(IFERROR(VLOOKUP(B48,'[1]Din Rep'!$B:$M,12,0),VLOOKUP(C48,'[1]Din Rep'!$C:$M,11,0)),\"\")","v":"45 DD"}]
[null,"AC0099",{"$f":"IFERROR(VLOOKUP(B49,'[1]Din Rep'!$B:$M,2,0),\"\")","v":"CHAVEIRO SANDÁLIA"},{"$f":"IFERROR(IFERROR(VLOOKUP(B49,'[1]Din Rep'!$B:$M,5,0),VLOOKUP(C49,'[1]Din Rep'!$C:$M,4,0)),\"\")","v":3.6050879999999994},{"$f":"IFERROR(IFERROR(VLOOKUP(B49,'[1]Din Rep'!$B:$M,7,0),VLOOKUP(C49,'[1]Din Rep'!$C:$M,6,0)),\"\")","v":3.8351999999999995},{"$f":"IFERROR(IFERROR(VLOOKUP(B49,'[1]Din Rep'!$B:$M,8,0),VLOOKUP(C49,'[1]Din Rep'!$C:$M,7,0)),\"\")","v":9.9263999999999992},{"$f":"IFERROR(IFERROR(VLOOKUP(B49,'[1]Din Rep'!$B:$M,10,0),VLOOKUP(C49,'[1]Din Rep'!$C:$M,9,0)),\"\")","v":2.2776470588235296},{"$f":"IFERROR(IFERROR(VLOOKUP(B49,'[1]Din Rep'!$B:$M,11,0),VLOOKUP(C49,'[1]Din Rep'!$C:$M,10,0)),\"\")","v":0.12},{"$f":"IFERROR(IFERROR(VLOOKUP(B49,'[1]Din Rep'!$B:$M,12,0),VLOOKUP(C49,'[1]Din Rep'!$C:$M,11,0)),\"\")","v":"45 DD"}]
[null,"AC0100",{"$f":"IFERROR(VLOOKUP(B50,'[1]Din Rep'!$B:$M,2,0),\"\")","v":"CHAVEIRO PRANCHA"},{"$f":"IFERROR(IFERROR(VLOOKUP(B50,'[1]Din Rep'!$B:$M,5,0),VLOOKUP(C50,'[1]Din Rep'!$C:$M,4,0)),\"\")","v":3.6050879999999994},{"$f":"IFERROR(IFERROR(VLOOKUP(B50,'[1]Din Rep'!$B:$M,7,0),VLOOKUP(C50,'[1]Din Rep'!$C:$M,6,0)),\"\")","v":3.8351999999999995},{"$f":"IFERROR(IFERROR(VLOOKUP(B50,'[1]Din Rep'!$B:$M,8,0),VLOOKUP(C50,'[1]Din Rep'!$C:$M,7,0)),\"\")","v":9.9263999999999992},{"$f":"IFERROR(IFERROR(VLOOKUP(B50,'[1]Din Rep'!$B:$M,10,0),VLOOKUP(C50,'[1]Din Rep'!$C:$M,9,0)),\"\")","v":2.2776470588235296},{"$f":"IFERROR(IFERROR(VLOOKUP(B50,'[1]Din Rep'!$B:$M,11,0),VLOOKUP(C50,'[1]Din Rep'!$C:$M,10,0)),\"\")","v":0.12},{"$f":"IFERROR(IFERROR(VLOOKUP(B50,'[1]Din Rep'!$B:$M,12,0),VLOOKUP(C50,'[1]Din Rep'!$C:$M,11,0)),\"\")","v":"45 DD"}]
[null,"AC0101",{"$f":"IFERROR(VLOOKUP(B51,'[1]Din Rep'!$B:$M,2,0),\"\")","v":"CHAVEIRO MOSQUETÃO"},{"$f":"IFERROR(IFERROR(VLOOKUP(B51,'[1]Din Rep'!$B:$M,5,0),VLOOKUP(C51,'[1]Din Rep'!$C:$M,4,0)),\"\")","v":5.7527999999999997},{"$f":"IFERROR(IFERROR(VLOOKUP(B51,'[1]Din Rep'!$B:$M,7,0),VLOOKUP(C51,'[1]Din Rep'!$C:$M,6,0)),\"\")","v":6.12},{"$f":"IFERROR(IFERROR(VLOOKUP(B51,'[1]Din Rep'!$B:$M,8,0),VLOOKUP(C51,'[1]Din Rep'!$C:$M,7,0)),\"\")","v":16.13},{"$f":"IFERROR(IFERROR(VLOOKUP(B51,'[1]Din Rep'!$B:$M,10,0),VLOOKUP(C51,'[1]Din Rep'!$C:$M,9,0)),\"\")","v":2.319346405228758},{"$f":"IFERROR(IFERROR(VLOOKUP(B51,'[1]Din Rep'!$B:$M,11,0),VLOOKUP(C51,'[1]Din Rep'!$C:$M,10,0)),\"\")","v":0.12},{"$f":"IFERROR(IFERROR(VLOOKUP(B51,'[1]Din Rep'!$B:$M,12,0),VLOOKUP(C51,'[1]Din Rep'!$C:$M,11,0)),\"\")","v":"45 DD"}]
[null,"AO0019",{"$f":"IFERROR(VLOOKUP(B52,'[1]Din Rep'!$B:$M,2,0),\"\")","v":"BOLSA DE MÃO DE NEOPRENE ACESSÓRIOS OPORTUNIDADES MORMAII"},{"$f":"IFERROR(IFERROR(VLOOKUP(B52,'[1]Din Rep'!$B:$M,5,0),VLOOKUP(C52,'[1]Din Rep'!$C:$M,4,0)),\"\")","v":12.592239999999999},{"$f":"IFERROR(IFERROR(VLOOKUP(B52,'[1]Din Rep'!$B:$M,7,0),VLOOKUP(C52,'[1]Din Rep'!$C:$M,6,0)),\"\")","v":13.395999999999999},{"$f":"IFERROR(IFERROR(VLOOKUP(B52,'[1]Din Rep'!$B:$M,8,0),VLOOKUP(C52,'[1]Din Rep'!$C:$M,7,0)),\"\")","v":34.9},{"$f":"IFERROR(IFERROR(VLOOKUP(B52,'[1]Din Rep'!$B:$M,10,0),VLOOKUP(C52,'[1]Din Rep'!$C:$M,9,0)),\"\")","v":2.3447297700806211},{"$f":"IFERROR(IFERROR(VLOOKUP(B52,'[1]Din Rep'!$B:$M,11,0),VLOOKUP(C52,'[1]Din Rep'!$C:$M,10,0)),\"\")","v":0.1},{"$f":"IFERROR(IFERROR(VLOOKUP(B52,'[1]Din Rep'!$B:$M,12,0),VLOOKUP(C52,'[1]Din Rep'!$C:$M,11,0)),\"\")","v":"45 DD"}]
[null,"AO0010",{"$f":"IFERROR(VLOOKUP(B53,'[1]Din Rep'!$B:$M,2,0),\"\")","v":"BOLSA ACESSÓRIOS OPORTUNIDADES MORMAII"},{"$f":"IFERROR(IFERROR(VLOOKUP(B53,'[1]Din Rep'!$B:$M,5,0),VLOOKUP(C53,'[1]Din Rep'!$C:$M,4,0)),\"\")","v":28.108819999999998},{"$f":"IFERROR(IFERROR(VLOOKUP(B53,'[1]Din Rep'!$B:$M,7,0),VLOOKUP(C53,'[1]Din Rep'!$C:$M,6,0)),\"\")","v":29.902999999999999},{"$f":"IFERROR(IFERROR(VLOOKUP(B53,'[1]Din Rep'!$B:$M,8,0),VLOOKUP(C53,'[1]Din Rep'!$C:$M,7,0)),\"\")","v":77.900000000000006},{"$f":"IFERROR(IFERROR(VLOOKUP(B53,'[1]Din Rep'!$B:$M,10,0),VLOOKUP(C53,'[1]Din Rep'!$C:$M,9,0)),\"\")","v":2.3445808112898376},{"$f":"IFERROR(IFERROR(VLOOKUP(B53,'[1]Din Rep'!$B:$M,11,0),VLOOKUP(C53,'[1]Din Rep'!$C:$M,10,0)),\"\")","v":0.1},{"$f":"IFERROR(IFERROR(VLOOKUP(B53,'[1]Din Rep'!$B:$M,12,0),VLOOKUP(C53,'[1]Din Rep'!$C:$M,11,0)),\"\")","v":"45 DD"}]
[null,"AC0112",{"$f":"IFERROR(VLOOKUP(B54,'[1]Din Rep'!$B:$M,2,0),\"\")","v":"BOLSA UTILITÁRIA GRANDE DE NEOPRENE ACESSÓRIOS MORMAII"},{"$f":"IFERROR(IFERROR(VLOOKUP(B54,'[1]Din Rep'!$B:$M,5,0),VLOOKUP(C54,'[1]Din Rep'!$C:$M,4,0)),\"\")","v":68.713999999999984},{"$f":"IFERROR(IFERROR(VLOOKUP(B54,'[1]Din Rep'!$B:$M,7,0),VLOOKUP(C54,'[1]Din Rep'!$C:$M,6,0)),\"\")","v":73.099999999999994},{"$f":"IFERROR(IFERROR(VLOOKUP(B54,'[1]Din Rep'!$B:$M,8,0),VLOOKUP(C54,'[1]Din Rep'!$C:$M,7,0)),\"\")","v":189.9},{"$f":"IFERROR(IFERROR(VLOOKUP(B54,'[1]Din Rep'!$B:$M,10,0),VLOOKUP(C54,'[1]Din Rep'!$C:$M,9,0)),\"\")","v":2.3380300957592342},{"$f":"IFERROR(IFERROR(VLOOKUP(B54,'[1]Din Rep'!$B:$M,11,0),VLOOKUP(C54,'[1]Din Rep'!$C:$M,10,0)),\"\")","v":0.1},{"$f":"IFERROR(IFERROR(VLOOKUP(B54,'[1]Din Rep'!$B:$M,12,0),VLOOKUP(C54,'[1]Din Rep'!$C:$M,11,0)),\"\")","v":"45 DD"}]
[null,"AC0109",{"$f":"IFERROR(VLOOKUP(B55,'[1]Din Rep'!$B:$M,2,0),\"\")","v":"MINI TRAVESSEIRO DE NEOPRENE ACESSÓRIOS MORMAII"},{"$f":"IFERROR(IFERROR(VLOOKUP(B55,'[1]Din Rep'!$B:$M,5,0),VLOOKUP(C55,'[1]Din Rep'!$C:$M,4,0)),\"\")","v":17.977499999999999},{"$f":"IFERROR(IFERROR(VLOOKUP(B55,'[1]Din Rep'!$B:$M,7,0),VLOOKUP(C55,'[1]Din Rep'!$C:$M,6,0)),\"\")","v":19.125},{"$f":"IFERROR(IFERROR(VLOOKUP(B55,'[1]Din Rep'!$B:$M,8,0),VLOOKUP(C55,'[1]Din Rep'!$C:$M,7,0)),\"\")","v":49.9},{"$f":"IFERROR(IFERROR(VLOOKUP(B55,'[1]Din Rep'!$B:$M,10,0),VLOOKUP(C55,'[1]Din Rep'!$C:$M,9,0)),\"\")","v":2.348235294117647},{"$f":"IFERROR(IFERROR(VLOOKUP(B55,'[1]Din Rep'!$B:$M,11,0),VLOOKUP(C55,'[1]Din Rep'!$C:$M,10,0)),\"\")","v":0.1},{"$f":"IFERROR(IFERROR(VLOOKUP(B55,'[1]Din Rep'!$B:$M,12,0),VLOOKUP(C55,'[1]Din Rep'!$C:$M,11,0)),\"\")","v":"45 DD"}]
[null,"AC0120",{"$f":"IFERROR(VLOOKUP(B56,'[1]Din Rep'!$B:$M,2,0),\"\")","v":"PORTA CELULAR DE NEOPRENE C/ VISOR PLÁSTICO ACESSÓRIOS MORMAII"},{"$f":"IFERROR(IFERROR(VLOOKUP(B56,'[1]Din Rep'!$B:$M,5,0),VLOOKUP(C56,'[1]Din Rep'!$C:$M,4,0)),\"\")","v":10.187250000000001},{"$f":"IFERROR(IFERROR(VLOOKUP(B56,'[1]Din Rep'!$B:$M,7,0),VLOOKUP(C56,'[1]Din Rep'!$C:$M,6,0)),\"\")","v":10.8375},{"$f":"IFERROR(IFERROR(VLOOKUP(B56,'[1]Din Rep'!$B:$M,8,0),VLOOKUP(C56,'[1]Din Rep'!$C:$M,7,0)),\"\")","v":29.9},{"$f":"IFERROR(IFERROR(VLOOKUP(B56,'[1]Din Rep'!$B:$M,10,0),VLOOKUP(C56,'[1]Din Rep'!$C:$M,9,0)),\"\")","v":2.4830449826989618},{"$f":"IFERROR(IFERROR(VLOOKUP(B56,'[1]Din Rep'!$B:$M,11,0),VLOOKUP(C56,'[1]Din Rep'!$C:$M,10,0)),\"\")","v":0.1},{"$f":"IFERROR(IFERROR(VLOOKUP(B56,'[1]Din Rep'!$B:$M,12,0),VLOOKUP(C56,'[1]Din Rep'!$C:$M,11,0)),\"\")","v":"45 DD"}]
["THERMO DRINK","AC0129",{"$f":"IFERROR(VLOOKUP(B57,'[1]Din Rep'!$B:$M,2,0),\"\")","v":"CAPA DE NEOPRENE P/ GALÃO DE ÁGUA 10L THERMO DRINK ACESSÓRIOS MORMAII"},{"$f":"IFERROR(IFERROR(VLOOKUP(B57,'[1]Din Rep'!$B:$M,5,0),VLOOKUP(C57,'[1]Din Rep'!$C:$M,4,0)),\"\")","v":23.890099999999997},{"$f":"IFERROR(IFERROR(VLOOKUP(B57,'[1]Din Rep'!$B:$M,7,0),VLOOKUP(C57,'[1]Din Rep'!$C:$M,6,0)),\"\")","v":25.414999999999999},{"$f":"IFERROR(IFERROR(VLOOKUP(B57,'[1]Din Rep'!$B:$M,8,0),VLOOKUP(C57,'[1]Din Rep'!$C:$M,7,0)),\"\")","v":65.900000000000006},{"$f":"IFERROR(IFERROR(VLOOKUP(B57,'[1]Din Rep'!$B:$M,10,0),VLOOKUP(C57,'[1]Din Rep'!$C:$M,9,0)),\"\")","v":2.3336612236867995},{"$f":"IFERROR(IFERROR(VLOOKUP(B57,'[1]Din Rep'!$B:$M,11,0),VLOOKUP(C57,'[1]Din Rep'!$C:$M,10,0)),\"\")","v":0.1},{"$f":"IFERROR(IFERROR(VLOOKUP(B57,'[1]Din Rep'!$B:$M,12,0),VLOOKUP(C57,'[1]Din Rep'!$C:$M,11,0)),\"\")","v":"45 DD"}]
[null,"AC0128",{"$f":"IFERROR(VLOOKUP(B58,'[1]Din Rep'!$B:$M,2,0),\"\")","v":"CAPA DE NEOPRENE P/ GALÃO DE ÁGUA 20L THERMO DRINK ACESSÓRIOS MORMAII"},{"$f":"IFERROR(IFERROR(VLOOKUP(B58,'[1]Din Rep'!$B:$M,5,0),VLOOKUP(C58,'[1]Din Rep'!$C:$M,4,0)),\"\")","v":31.880099999999999},{"$f":"IFERROR(IFERROR(VLOOKUP(B58,'[1]Din Rep'!$B:$M,7,0),VLOOKUP(C58,'[1]Din Rep'!$C:$M,6,0)),\"\")","v":33.914999999999999},{"$f":"IFERROR(IFERROR(VLOOKUP(B58,'[1]Din Rep'!$B:$M,8,0),VLOOKUP(C58,'[1]Din Rep'!$C:$M,7,0)),\"\")","v":87.9},{"$f":"IFERROR(IFERROR(VLOOKUP(B58,'[1]Din Rep'!$B:$M,10,0),VLOOKUP(C58,'[1]Din Rep'!$C:$M,9,0)),\"\")","v":2.3325961963732862},{"$f":"IFERROR(IFERROR(VLOOKUP(B58,'[1]Din Rep'!$B:$M,11,0),VLOOKUP(C58,'[1]Din Rep'!$C:$M,10,0)),\"\")","v":0.1},{"$f":"IFERROR(IFERROR(VLOOKUP(B58,'[1]Din Rep'!$B:$M,12,0),VLOOKUP(C58,'[1]Din Rep'!$C:$M,11,0)),\"\")","v":"45 DD"}]
[null,"AC0134",{"$f":"IFERROR(VLOOKUP(B59,'[1]Din Rep'!$B:$M,2,0),\"\")","v":"PORTA LONG NECK 330ML DE NEOPRENE THERMO DRINK ACESSÓRIOS MORMAII"},{"$f":"IFERROR(IFERROR(VLOOKUP(B59,'[1]Din Rep'!$B:$M,5,0),VLOOKUP(C59,'[1]Din Rep'!$C:$M,4,0)),\"\")","v":7.9101000000000008},{"$f":"IFERROR(IFERROR(VLOOKUP(B59,'[1]Din Rep'!$B:$M,7,0),VLOOKUP(C59,'[1]Din Rep'!$C:$M,6,0)),\"\")","v":8.4150000000000009},{"$f":"IFERROR(IFERROR(VLOOKUP(B59,'[1]Din Rep'!$B:$M,8,0),VLOOKUP(C59,'[1]Din Rep'!$C:$M,7,0)),\"\")","v":21.9},{"$f":"IFERROR(IFERROR(VLOOKUP(B59,'[1]Din Rep'!$B:$M,10,0),VLOOKUP(C59,'[1]Din Rep'!$C:$M,9,0)),\"\")","v":2.3422459893048124},{"$f":"IFERROR(IFERROR(VLOOKUP(B59,'[1]Din Rep'!$B:$M,11,0),VLOOKUP(C59,'[1]Din Rep'!$C:$M,10,0)),\"\")","v":0.1},{"$f":"IFERROR(IFERROR(VLOOKUP(B59,'[1]Din Rep'!$B:$M,12,0),VLOOKUP(C59,'[1]Din Rep'!$C:$M,11,0)),\"\")","v":"45 DD"}]
[null,"AC0133",{"$f":"IFERROR(VLOOKUP(B60,'[1]Din Rep'!$B:$M,2,0),\"\")","v":"PORTA GARRAFA 600ML DE NEOPRENE THERMO DRINK ACESSÓRIOS MORMAII"},{"$f":"IFERROR(IFERROR(VLOOKUP(B60,'[1]Din Rep'!$B:$M,5,0),VLOOKUP(C60,'[1]Din Rep'!$C:$M,4,0)),\"\")","v":10.3071},{"$f":"IFERROR(IFERROR(VLOOKUP(B60,'[1]Din Rep'!$B:$M,7,0),VLOOKUP(C60,'[1]Din Rep'!$C:$M,6,0)),\"\")","v":10.965},{"$f":"IFERROR(IFERROR(VLOOKUP(B60,'[1]Din Rep'!$B:$M,8,0),VLOOKUP(C60,'[1]Din Rep'!$C:$M,7,0)),\"\")","v":28.9},{"$f":"IFERROR(IFERROR(VLOOKUP(B60,'[1]Din Rep'!$B:$M,10,0),VLOOKUP(C60,'[1]Din Rep'!$C:$M,9,0)),\"\")","v":2.3720930232558137},{"$f":"IFERROR(IFERROR(VLOOKUP(B60,'[1]Din Rep'!$B:$M,11,0),VLOOKUP(C60,'[1]Din Rep'!$C:$M,10,0)),\"\")","v":0.1},{"$f":"IFERROR(IFERROR(VLOOKUP(B60,'[1]Din Rep'!$B:$M,12,0),VLOOKUP(C60,'[1]Din Rep'!$C:$M,11,0)),\"\")","v":"45 DD"}]
[null,"AC0132",{"$f":"IFERROR(VLOOKUP(B61,'[1]Din Rep'!$B:$M,2,0),\"\")","v":"PORTA GARRAFA 1L DE NEOPRENE THERMO DRINK ACESSÓRIOS MORMAII"},{"$f":"IFERROR(IFERROR(VLOOKUP(B61,'[1]Din Rep'!$B:$M,5,0),VLOOKUP(C61,'[1]Din Rep'!$C:$M,4,0)),\"\")","v":11.1061},{"$f":"IFERROR(IFERROR(VLOOKUP(B61,'[1]Din Rep'!$B:$M,7,0),VLOOKUP(C61,'[1]Din Rep'!$C:$M,6,0)),\"\")","v":11.815},{"$f":"IFERROR(IFERROR(VLOOKUP(B61,'[1]Din Rep'!$B:$M,8,0),VLOOKUP(C61,'[1]Din Rep'!$C:$M,7,0)),\"\")","v":30.9},{"$f":"IFERROR(IFERROR(VLOOKUP(B61,'[1]Din Rep'!$B:$M,10,0),VLOOKUP(C61,'[1]Din Rep'!$C:$M,9,0)),\"\")","v":2.3537875581887433},{"$f":"IFERROR(IFERROR(VLOOKUP(B61,'[1]Din Rep'!$B:$M,11,0),VLOOKUP(C61,'[1]Din Rep'!$C:$M,10,0)),\"\")","v":0.1},{"$f":"IFERROR(IFERROR(VLOOKUP(B61,'[1]Din Rep'!$B:$M,12,0),VLOOKUP(C61,'[1]Din Rep'!$C:$M,11,0)),\"\")","v":"45 DD"}]
[null,"AC0135",{"$f":"IFERROR(VLOOKUP(B62,'[1]Din Rep'!$B:$M,2,0),\"\")","v":"PORTA LATA 350ML DE NEOPRENE THERMO DRINK ACESSÓRIOS MORMAII"},{"$f":"IFERROR(IFERROR(VLOOKUP(B62,'[1]Din Rep'!$B:$M,5,0),VLOOKUP(C62,'[1]Din Rep'!$C:$M,4,0)),\"\")","v":5.9924999999999997},{"$f":"IFERROR(IFERROR(VLOOKUP(B62,'[1]Din Rep'!$B:$M,7,0),VLOOKUP(C62,'[1]Din Rep'!$C:$M,6,0)),\"\")","v":6.375},{"$f":"IFERROR(IFERROR(VLOOKUP(B62,'[1]Din Rep'!$B:$M,8,0),VLOOKUP(C62,'[1]Din Rep'!$C:$M,7,0)),\"\")","v":16.899999999999999},{"$f":"IFERROR(IFERROR(VLOOKUP(B62,'[1]Din Rep'!$B:$M,10,0),VLOOKUP(C62,'[1]Din Rep'!$C:$M,9,0)),\"\")","v":2.3858823529411763},{"$f":"IFERROR(IFERROR(VLOOKUP(B62,'[1]Din Rep'!$B:$M,11,0),VLOOKUP(C62,'[1]Din Rep'!$C:$M,10,0)),\"\")","v":0.1},{"$f":"IFERROR(IFERROR(VLOOKUP(B62,'[1]Din Rep'!$B:$M,12,0),VLOOKUP(C62,'[1]Din Rep'!$C:$M,11,0)),\"\")","v":"45 DD"}]
[null,"AC0136",{"$f":"IFERROR(VLOOKUP(B63,'[1]Din Rep'!$B:$M,2,0),\"\")","v":"PORTA LATA 470ML DE NEOPRENE THERMO DRINK ACESSÓRIOS MORMAII"},{"$f":"IFERROR(IFERROR(VLOOKUP(B63,'[1]Din Rep'!$B:$M,5,0),VLOOKUP(C63,'[1]Din Rep'!$C:$M,4,0)),\"\")","v":6.3120999999999992},{"$f":"IFERROR(IFERROR(VLOOKUP(B63,'[1]Din Rep'!$B:$M,7,0),VLOOKUP(C63,'[1]Din Rep'!$C:$M,6,0)),\"\")","v":6.7149999999999999},{"$f":"IFERROR(IFERROR(VLOOKUP(B63,'[1]Din Rep'!$B:$M,8,0),VLOOKUP(C63,'[1]Din Rep'!$C:$M,7,0)),\"\")","v":17.899999999999999},{"$f":"IFERROR(IFERROR(VLOOKUP(B63,'[1]Din Rep'!$B:$M,10,0),VLOOKUP(C63,'[1]Din Rep'!$C:$M,9,0)),\"\")","v":2.3991064780342515},{"$f":"IFERROR(IFERROR(VLOOKUP(B63,'[1]Din Rep'!$B:$M,11,0),VLOOKUP(C63,'[1]Din Rep'!$C:$M,10,0)),\"\")","v":0.1},{"$f":"IFERROR(IFERROR(VLOOKUP(B63,'[1]Din Rep'!$B:$M,12,0),VLOOKUP(C63,'[1]Din Rep'!$C:$M,11,0)),\"\")","v":"45 DD"}]
[null,"AC0137",{"$f":"IFERROR(VLOOKUP(B64,'[1]Din Rep'!$B:$M,2,0),\"\")","v":"PORTA LATA 700ML DE NEOPRENE THERMO DRINK ACESSÓRIOS MORMAII"},{"$f":"IFERROR(IFERROR(VLOOKUP(B64,'[1]Din Rep'!$B:$M,5,0),VLOOKUP(C64,'[1]Din Rep'!$C:$M,4,0)),\"\")","v":7.1110999999999995},{"$f":"IFERROR(IFERROR(VLOOKUP(B64,'[1]Din Rep'!$B:$M,7,0),VLOOKUP(C64,'[1]Din Rep'!$C:$M,6,0)),\"\")","v":7.5650000000000004},{"$f":"IFERROR(IFERROR(VLOOKUP(B64,'[1]Din Rep'!$B:$M,8,0),VLOOKUP(C64,'[1]Din Rep'!$C:$M,7,0)),\"\")","v":19.899999999999999},{"$f":"IFERROR(IFERROR(VLOOKUP(B64,'[1]Din Rep'!$B:$M,10,0),VLOOKUP(C64,'[1]Din Rep'!$C:$M,9,0)),\"\")","v":2.3674818241903499},{"$f":"IFERROR(IFERROR(VLOOKUP(B64,'[1]Din Rep'!$B:$M,11,0),VLOOKUP(C64,'[1]Din Rep'!$C:$M,10,0)),\"\")","v":0.1},{"$f":"IFERROR(IFERROR(VLOOKUP(B64,'[1]Din Rep'!$B:$M,12,0),VLOOKUP(C64,'[1]Din Rep'!$C:$M,11,0)),\"\")","v":"45 DD"}]
[null,"AC0138",{"$f":"IFERROR(VLOOKUP(B65,'[1]Din Rep'!$B:$M,2,0),\"\")","v":"KIT DESCANSO DE COPO EM NEOPRENE THERMO DRINK ACESSÓRIOS MORMAII"},{"$f":"IFERROR(IFERROR(VLOOKUP(B65,'[1]Din Rep'!$B:$M,5,0),VLOOKUP(C65,'[1]Din Rep'!$C:$M,4,0)),\"\")","v":3.9150999999999998},{"$f":"IFERROR(IFERROR(VLOOKUP(B65,'[1]Din Rep'!$B:$M,7,0),VLOOKUP(C65,'[1]Din Rep'!$C:$M,6,0)),\"\")","v":4.165},{"$f":"IFERROR(IFERROR(VLOOKUP(B65,'[1]Din Rep'!$B:$M,8,0),VLOOKUP(C65,'[1]Din Rep'!$C:$M,7,0)),\"\")","v":10.9},{"$f":"IFERROR(IFERROR(VLOOKUP(B65,'[1]Din Rep'!$B:$M,10,0),VLOOKUP(C65,'[1]Din Rep'!$C:$M,9,0)),\"\")","v":2.355342136854742},{"$f":"IFERROR(IFERROR(VLOOKUP(B65,'[1]Din Rep'!$B:$M,11,0),VLOOKUP(C65,'[1]Din Rep'!$C:$M,10,0)),\"\")","v":0.1},{"$f":"IFERROR(IFERROR(VLOOKUP(B65,'[1]Din Rep'!$B:$M,12,0),VLOOKUP(C65,'[1]Din Rep'!$C:$M,11,0)),\"\")","v":"45 DD"}]
[null,"AC0131",{"$f":"IFERROR(VLOOKUP(B66,'[1]Din Rep'!$B:$M,2,0),\"\")","v":"PORTA GARRAFA 500ML DE NEOPRENE THERMO DRINK ACESSÓRIOS MORMAII"},{"$f":"IFERROR(IFERROR(VLOOKUP(B66,'[1]Din Rep'!$B:$M,5,0),VLOOKUP(C66,'[1]Din Rep'!$C:$M,4,0)),\"\")","v":7.9101000000000008},{"$f":"IFERROR(IFERROR(VLOOKUP(B66,'[1]Din Rep'!$B:$M,7,0),VLOOKUP(C66,'[1]Din Rep'!$C:$M,6,0)),\"\")","v":8.4150000000000009},{"$f":"IFERROR(IFERROR(VLOOKUP(B66,'[1]Din Rep'!$B:$M,8,0),VLOOKUP(C66,'[1]Din Rep'!$C:$M,7,0)),\"\")","v":21.9},{"$f":"IFERROR(IFERROR(VLOOKUP(B66,'[1]Din Rep'!$B:$M,10,0),VLOOKUP(C66,'[1]Din Rep'!$C:$M,9,0)),\"\")","v":2.3422459893048124},{"$f":"IFERROR(IFERROR(VLOOKUP(B66,'[1]Din Rep'!$B:$M,11,0),VLOOKUP(C66,'[1]Din Rep'!$C:$M,10,0)),\"\")","v":0.1},{"$f":"IFERROR(IFERROR(VLOOKUP(B66,'[1]Din Rep'!$B:$M,12,0),VLOOKUP(C66,'[1]Din Rep'!$C:$M,11,0)),\"\")","v":"45 DD"}]
[null,"AC0130",{"$f":"IFERROR(VLOOKUP(B67,'[1]Din Rep'!$B:$M,2,0),\"\")","v":"PORTA GARRAFA DE NEOPRENE P/ ÁGUA 1,5L THERMO DRINK ACESSÓRIOS MORMAII"},{"$f":"IFERROR(IFERROR(VLOOKUP(B67,'[1]Din Rep'!$B:$M,5,0),VLOOKUP(C67,'[1]Din Rep'!$C:$M,4,0)),\"\")","v":11.1061},{"$f":"IFERROR(IFERROR(VLOOKUP(B67,'[1]Din Rep'!$B:$M,7,0),VLOOKUP(C67,'[1]Din Rep'!$C:$M,6,0)),\"\")","v":11.815},{"$f":"IFERROR(IFERROR(VLOOKUP(B67,'[1]Din Rep'!$B:$M,8,0),VLOOKUP(C67,'[1]Din Rep'!$C:$M,7,0)),\"\")","v":30.9},{"$f":"IFERROR(IFERROR(VLOOKUP(B67,'[1]Din Rep'!$B:$M,10,0),VLOOKUP(C67,'[1]Din Rep'!$C:$M,9,0)),\"\")","v":2.3537875581887433},{"$f":"IFERROR(IFERROR(VLOOKUP(B67,'[1]Din Rep'!$B:$M,11,0),VLOOKUP(C67,'[1]Din Rep'!$C:$M,10,0)),\"\")","v":0.1},{"$f":"IFERROR(IFERROR(VLOOKUP(B67,'[1]Din Rep'!$B:$M,12,0),VLOOKUP(C67,'[1]Din Rep'!$C:$M,11,0)),\"\")","v":"45 DD"}]

{"sheet":"Plan1","index":8,"n_rows":0,"n_cols":0,"rows_kept":0,"cut":false,"hidden":false,"merged":[]}